{
  "DELETE Employees" : {
    "transaction" : "DELETE Employees",
    "sampleCount" : 10,
    "errorCount" : 10,
    "errorPct" : 100.0,
    "meanResTime" : 261.59999999999997,
    "medianResTime" : 262.0,
    "minResTime" : 246.0,
    "maxResTime" : 281.0,
    "pct1ResTime" : 280.1,
    "pct2ResTime" : 281.0,
    "pct3ResTime" : 281.0,
    "throughput" : 0.9492168960607499,
    "receivedKBytesPerSec" : 0.7323060037968676,
    "sentKBytesPerSec" : 0.1816860465116279
  },
  "POST Register" : {
    "transaction" : "POST Register",
    "sampleCount" : 10,
    "errorCount" : 0,
    "errorPct" : 0.0,
    "meanResTime" : 742.1,
    "medianResTime" : 740.5,
    "minResTime" : 341.0,
    "maxResTime" : 1163.0,
    "pct1ResTime" : 1159.9,
    "pct2ResTime" : 1163.0,
    "pct3ResTime" : 1163.0,
    "throughput" : 0.8535336292249915,
    "receivedKBytesPerSec" : 0.3900915414817344,
    "sentKBytesPerSec" : 0.21338340730624789
  },
  "GET Dashboard" : {
    "transaction" : "GET Dashboard",
    "sampleCount" : 10,
    "errorCount" : 10,
    "errorPct" : 100.0,
    "meanResTime" : 264.20000000000005,
    "medianResTime" : 261.5,
    "minResTime" : 251.0,
    "maxResTime" : 286.0,
    "pct1ResTime" : 285.0,
    "pct2ResTime" : 286.0,
    "pct3ResTime" : 286.0,
    "throughput" : 0.9250693802035153,
    "receivedKBytesPerSec" : 0.5122210337650324,
    "sentKBytesPerSec" : 0.16983695652173914
  },
  "GET Employees" : {
    "transaction" : "GET Employees",
    "sampleCount" : 10,
    "errorCount" : 0,
    "errorPct" : 0.0,
    "meanResTime" : 1800.6000000000001,
    "medianResTime" : 1768.0,
    "minResTime" : 1665.0,
    "maxResTime" : 2006.0,
    "pct1ResTime" : 1996.1000000000001,
    "pct2ResTime" : 2006.0,
    "pct3ResTime" : 2006.0,
    "throughput" : 0.8194034742707309,
    "receivedKBytesPerSec" : 82.78375686250409,
    "sentKBytesPerSec" : 0.14003477343493936
  },
  "GET All Grades by Level" : {
    "transaction" : "GET All Grades by Level",
    "sampleCount" : 10,
    "errorCount" : 10,
    "errorPct" : 100.0,
    "meanResTime" : 263.6,
    "medianResTime" : 263.0,
    "minResTime" : 255.0,
    "maxResTime" : 279.0,
    "pct1ResTime" : 278.1,
    "pct2ResTime" : 279.0,
    "pct3ResTime" : 279.0,
    "throughput" : 0.9264406151565684,
    "receivedKBytesPerSec" : 0.5410268436168242,
    "sentKBytesPerSec" : 0.17099343385214008
  },
  "GET Detail Employees" : {
    "transaction" : "GET Detail Employees",
    "sampleCount" : 10,
    "errorCount" : 0,
    "errorPct" : 0.0,
    "meanResTime" : 262.99999999999994,
    "medianResTime" : 262.5,
    "minResTime" : 252.0,
    "maxResTime" : 276.0,
    "pct1ResTime" : 275.9,
    "pct2ResTime" : 276.0,
    "pct3ResTime" : 276.0,
    "throughput" : 0.946880030300161,
    "receivedKBytesPerSec" : 1.1114744105671812,
    "sentKBytesPerSec" : 0.16366969273743018
  },
  "POST Create Employees" : {
    "transaction" : "POST Create Employees",
    "sampleCount" : 10,
    "errorCount" : 10,
    "errorPct" : 100.0,
    "meanResTime" : 278.49999999999994,
    "medianResTime" : 276.5,
    "minResTime" : 264.0,
    "maxResTime" : 292.0,
    "pct1ResTime" : 291.4,
    "pct2ResTime" : 292.0,
    "pct3ResTime" : 292.0,
    "throughput" : 0.9450902561194594,
    "receivedKBytesPerSec" : 0.6820524406955865,
    "sentKBytesPerSec" : 0.5122315352991211
  },
  "POST Forgot Password" : {
    "transaction" : "POST Forgot Password",
    "sampleCount" : 10,
    "errorCount" : 10,
    "errorPct" : 100.0,
    "meanResTime" : 263.7,
    "medianResTime" : 262.5,
    "minResTime" : 250.0,
    "maxResTime" : 291.0,
    "pct1ResTime" : 289.2,
    "pct2ResTime" : 291.0,
    "pct3ResTime" : 291.0,
    "throughput" : 0.9237875288683602,
    "receivedKBytesPerSec" : 0.6323975173210162,
    "sentKBytesPerSec" : 0.2101977482678984
  },
  "POST Login" : {
    "transaction" : "POST Login",
    "sampleCount" : 10,
    "errorCount" : 10,
    "errorPct" : 100.0,
    "meanResTime" : 263.3,
    "medianResTime" : 264.0,
    "minResTime" : 248.0,
    "maxResTime" : 282.0,
    "pct1ResTime" : 280.9,
    "pct2ResTime" : 282.0,
    "pct3ResTime" : 282.0,
    "throughput" : 0.9231905465288035,
    "receivedKBytesPerSec" : 0.4994605105243722,
    "sentKBytesPerSec" : 0.22809297682791727
  },
  "Total" : {
    "transaction" : "Total",
    "sampleCount" : 130,
    "errorCount" : 90,
    "errorPct" : 69.23077,
    "meanResTime" : 419.6461538461537,
    "medianResTime" : 264.0,
    "minResTime" : 246.0,
    "maxResTime" : 2006.0,
    "pct1ResTime" : 1128.5,
    "pct2ResTime" : 1713.6,
    "pct3ResTime" : 1975.3099999999997,
    "throughput" : 8.031136096867858,
    "receivedKBytesPerSec" : 67.55517544943473,
    "sentKBytesPerSec" : 2.0825932847346635
  },
  "POST Change Password" : {
    "transaction" : "POST Change Password",
    "sampleCount" : 10,
    "errorCount" : 10,
    "errorPct" : 100.0,
    "meanResTime" : 267.2,
    "medianResTime" : 260.5,
    "minResTime" : 253.0,
    "maxResTime" : 293.0,
    "pct1ResTime" : 292.8,
    "pct2ResTime" : 293.0,
    "pct3ResTime" : 293.0,
    "throughput" : 0.9243852837862822,
    "receivedKBytesPerSec" : 0.6328067225919763,
    "sentKBytesPerSec" : 0.2744268811240525
  },
  "GET Dashboard Direktur" : {
    "transaction" : "GET Dashboard Direktur",
    "sampleCount" : 10,
    "errorCount" : 10,
    "errorPct" : 100.0,
    "meanResTime" : 267.1,
    "medianResTime" : 263.5,
    "minResTime" : 259.0,
    "maxResTime" : 294.0,
    "pct1ResTime" : 291.8,
    "pct2ResTime" : 294.0,
    "pct3ResTime" : 294.0,
    "throughput" : 0.9257544899092761,
    "receivedKBytesPerSec" : 0.524353129050176,
    "sentKBytesPerSec" : 0.17900330957230143
  },
  "PUT Update Employees" : {
    "transaction" : "PUT Update Employees",
    "sampleCount" : 10,
    "errorCount" : 10,
    "errorPct" : 100.0,
    "meanResTime" : 261.4,
    "medianResTime" : 262.5,
    "minResTime" : 248.0,
    "maxResTime" : 270.0,
    "pct1ResTime" : 269.9,
    "pct2ResTime" : 270.0,
    "pct3ResTime" : 270.0,
    "throughput" : 0.9482268158543523,
    "receivedKBytesPerSec" : 0.5268955646690688,
    "sentKBytesPerSec" : 0.514857528920918
  },
  "GET All Grades" : {
    "transaction" : "GET All Grades",
    "sampleCount" : 10,
    "errorCount" : 0,
    "errorPct" : 0.0,
    "meanResTime" : 259.1000000000001,
    "medianResTime" : 258.0,
    "minResTime" : 249.0,
    "maxResTime" : 272.0,
    "pct1ResTime" : 271.8,
    "pct2ResTime" : 272.0,
    "pct3ResTime" : 272.0,
    "throughput" : 0.9270418095856123,
    "receivedKBytesPerSec" : 0.9532959233336423,
    "sentKBytesPerSec" : 0.1557140539538333
  }
}