<?xml version="1.0" encoding="utf-8"?>
<!-- Generator: Adobe Illustrator 24.0.1, SVG Export Plug-In . SVG Version: 6.00 Build 0)  -->
<svg version="1.1" id="_x37_47ad91c-18bb-4936-b655-cddf352f94cc"
	 xmlns="http://www.w3.org/2000/svg" xmlns:xlink="http://www.w3.org/1999/xlink" x="0px" y="0px" viewBox="0 0 1081.9 662.6"
	 style="enable-background:new 0 0 1081.9 662.6;" xml:space="preserve">
<style type="text/css">
	.st0{opacity:0.5;}
	.st1{fill:url(#SVGID_1_);}
	.st2{fill:#FFFFFF;}
	.st3{fill:#2CDD9B;}
	.st4{fill:#E0E0E0;}
	.st5{fill:url(#SVGID_2_);}
	.st6{fill:#FFFF00;}
	.st7{opacity:5.000000e-02;enable-background:new    ;}
	.st8{fill:url(#SVGID_3_);}
	.st9{fill:#5AAAE7;}
	.st10{fill:#3D9AE2;}
	.st11{fill:#FFD422;}
	.st12{fill:#EBBF00;}
	.st13{fill:#D1D3D4;}
	.st14{fill:#E6E7E8;}
	.st15{fill:#FFC477;}
	.st16{fill:#1E81CE;}
	.st17{fill:#ED1C24;}
	.st18{fill:#FF6A4D;}
	.st19{fill:#E64D2E;}
	.st20{fill:#474F54;}
	.st21{fill:#F2F9FF;}
	.st22{fill:#FF9100;}
	.st23{fill:#FABE2C;}
	.st24{fill:#32393F;}
	.st25{fill:#575F64;}
	.st26{fill:#FFE1BA;}
	.st27{fill:#FFBFAB;}
	.st28{fill:#DFE7F4;}
	.st29{fill:#C7CFE1;}
	.st30{fill:#012631;}
	.st31{fill:#4F575B;}
	.st32{fill:#FFCD37;}
	.st33{fill:#FFAB37;}
	.st34{fill:#FFEEBC;}
</style>
<title>experts3</title>
<g class="st0">
	
		<linearGradient id="SVGID_1_" gradientUnits="userSpaceOnUse" x1="863.7599" y1="234.39" x2="863.7599" y2="662" gradientTransform="matrix(1 0 0 -1 0 662)">
		<stop  offset="0" style="stop-color:#808080;stop-opacity:0.25"/>
		<stop  offset="0.54" style="stop-color:#808080;stop-opacity:0.12"/>
		<stop  offset="1" style="stop-color:#808080;stop-opacity:0.1"/>
	</linearGradient>
	<rect x="645.6" class="st1" width="436.4" height="427.6"/>
</g>
<rect x="647.8" y="3.3" class="st2" width="432" height="421"/>
<g class="st0">
	<rect x="691.6" y="38.3" class="st3" width="344.3" height="267.3"/>
</g>
<rect x="716" y="343.1" class="st4" width="304" height="14"/>
<rect x="764.5" y="371.1" class="st4" width="207" height="14"/>
<g class="st0">
	
		<linearGradient id="SVGID_2_" gradientUnits="userSpaceOnUse" x1="218.19" y1="119.87" x2="218.19" y2="547.48" gradientTransform="matrix(1 0 0 -1 0 662)">
		<stop  offset="0" style="stop-color:#808080;stop-opacity:0.25"/>
		<stop  offset="0.54" style="stop-color:#808080;stop-opacity:0.12"/>
		<stop  offset="1" style="stop-color:#808080;stop-opacity:0.1"/>
	</linearGradient>
	<rect y="114.5" class="st5" width="436.4" height="427.6"/>
</g>
<rect x="2.2" y="117.8" class="st2" width="432" height="421"/>
<g class="st0">
	<rect x="46" y="152.8" class="st3" width="344.3" height="267.3"/>
</g>
<polygon class="st6" points="191.1,222.8 191.1,222.8 191.1,222.8 191.1,222.8 "/>
<path class="st6" d="M191,222.8"/>
<polygon class="st7" points="263.7,349.7 263.7,342.1 271.3,347.1 266.2,345.9 "/>
<polygon class="st7" points="273.9,367.5 274.3,368.9 295.2,368.9 295.5,367.5 "/>
<rect x="59" y="452.1" class="st4" width="304" height="14"/>
<rect x="107.4" y="480.1" class="st4" width="207" height="14"/>
<g class="st0">
	
		<linearGradient id="SVGID_3_" gradientUnits="userSpaceOnUse" x1="543.14" y1="-0.59" x2="543.14" y2="427.02" gradientTransform="matrix(1 0 0 -1 0 662)">
		<stop  offset="0" style="stop-color:#808080;stop-opacity:0.25"/>
		<stop  offset="0.54" style="stop-color:#808080;stop-opacity:0.12"/>
		<stop  offset="1" style="stop-color:#808080;stop-opacity:0.1"/>
	</linearGradient>
	<rect x="325" y="235" class="st8" width="436.4" height="427.6"/>
</g>
<rect x="327.1" y="238.3" class="st2" width="432" height="421"/>
<g class="st0">
	<rect x="371" y="273.2" class="st3" width="344.3" height="267.3"/>
</g>
<rect x="392" y="569.1" class="st4" width="304" height="14"/>
<rect x="440.5" y="597.1" class="st4" width="207" height="14"/>
<g id="Online_Shopping-Shopping-Smartphone-Shopping_Bag-Commerce">
	<path class="st9" d="M244.2,213.4v140.7c0,13-10.6,23.5-23.6,23.5h-78.8c-8.5,0-16.3-4.5-20.5-11.7v0c-2.1-3.6-3.2-7.6-3.2-11.7
		V213.4c0-13,10.6-23.5,23.6-23.5h78.8c12.4,0,22.6,9.5,23.6,21.7C244.2,212.2,244.2,212.8,244.2,213.4z"/>
	<path class="st10" d="M244.2,222.2v107.5c-6.3-2.7-12.1-6.5-17.1-11.3l-27.7,5.1l14.3-24.1C200.6,269.8,214.3,235.2,244.2,222.2
		C244.2,222.2,244.2,222.2,244.2,222.2L244.2,222.2z"/>
	<path class="st11" d="M318.2,278.3c-5.7,31.9-36.3,53.2-68.5,47.6c-1.9-0.3-3.7-0.7-5.5-1.3c-9.4-2.6-18-7.4-25-14l-27.7,5.1
		l14.3-24.1c-13.1-29.7,0.5-64.2,30.4-77.2c10.7-4.6,22.5-6,34-4C302.4,216,323.8,246.4,318.2,278.3L318.2,278.3z"/>
	<path class="st12" d="M283.6,268.1h-7.9v-19.5c0-4.3-3.5-7.8-7.9-7.8s-7.9,3.5-7.9,7.8v19.5h-7.9v-19.5c0-8.6,7.1-15.6,15.8-15.6
		c8.7,0,15.8,7,15.8,15.6V268.1z"/>
	<path class="st12" d="M240.3,256.4v46.9c0,4.3,3.5,7.8,7.9,7.8h39.4c4.3,0,7.9-3.5,7.9-7.8v-46.9H240.3z"/>
	<path class="st13" d="M287.6,287.7v7.8c0,4.3-3.5,7.8-7.9,7.8h-39.4c-4.3,0-7.9-3.5-7.9-7.8v-7.8H287.6z"/>
	<path class="st10" d="M232.4,248.6h55.2v39.1h-55.2V248.6z"/>
	<path class="st14" d="M189,346.3c4.3,0,7.9,3.5,7.9,7.8c0,4.3-3.5,7.8-7.9,7.8h-15.8c-4.3,0-7.9-3.5-7.9-7.8c0-4.3,3.5-7.8,7.9-7.8
		H189z"/>
	<path class="st14" d="M168.9,349.1c0,2.1-0.5,4.1-1.6,5.9l-1.3,2.3c-0.4-1-0.7-2-0.7-3.1c0-2.1,0.8-4.1,2.3-5.5
		c0.4-0.4,0.7-0.7,1.1-1C168.9,348.1,168.9,348.6,168.9,349.1L168.9,349.1z"/>
	<path class="st10" d="M168.7,257.1c6.2,6.1,6.2,16,0,22.2s-16.2,6.1-22.3,0c-6.2-6.1-6.2-16,0-22.2c3-2.9,7-4.6,11.2-4.6
		C161.7,252.5,165.7,254.2,168.7,257.1z"/>
	<path class="st11" d="M160.8,249.3c6.2,6.1,6.2,16,0,22.2s-16.2,6.1-22.3,0c-6.2-6.1-6.2-16,0-22.2c3-2.9,7-4.6,11.2-4.6
		C153.8,244.7,157.8,246.3,160.8,249.3z"/>
	<path class="st15" d="M161,341.3c0-6.5-5.3-11.7-11.8-11.7c-4.2,0-8.1,2.2-10.3,5.9l-17.7,30.4c-2.1-3.6-3.2-7.6-3.2-11.7v-62.5
		c-2.7,0.4-4.9,2-6.1,4.5l-17.9,38.5c-2.4,5.1-3.6,10.7-3.6,16.3v69.6l63.1,0v-17c0-4.3-1.2-8.4-3.4-12.1l-8.4-13.9l17.7-30.5
		C160.5,345.4,161,343.3,161,341.3L161,341.3z"/>
	<path class="st10" d="M149.6,201.7h7.9v7.8h-7.9V201.7z"/>
	<path class="st10" d="M165.4,201.7h31.5v7.8h-31.5V201.7z"/>
	<path class="st16" d="M275.7,260.3h-7.9v-19.5c0-4.3-3.5-7.8-7.9-7.8s-7.9,3.5-7.9,7.8v19.5h-7.9v-19.5c0-8.6,7.1-15.6,15.8-15.6
		c8.7,0,15.8,7,15.8,15.6V260.3z"/>
	<path class="st17" d="M142.9,261.5l23.6-23.5l5.6,5.5L148.5,267L142.9,261.5z"/>
	<g>
		<path class="st16" d="M177.2,248.6H193v7.8h-15.8V248.6z"/>
		<path class="st16" d="M177.2,264.2H193v7.8h-15.8V264.2z"/>
	</g>
</g>
<g>
	<path class="st18" d="M871.5,61.1c-11.8,0-21.3,9.6-21.3,21.3V90l14.2,7.1h7.1h7.1l14.2-7.1v-7.6C892.8,70.6,883.3,61.1,871.5,61.1
		z"/>
	<path class="st19" d="M892.8,90v-7.6c0-11.8-9.6-21.3-21.3-21.3v36h7.1L892.8,90z"/>
	<path class="st20" d="M764.5,275.2c3.3,16.2,18.3,28.4,35.5,28.4s32.7-12.2,36-28.4l-15.4-7.1h-46.2L764.5,275.2z"/>
	<path class="st21" d="M800,289.4c-11.8,0-21.3-9.6-21.3-21.3c0-11.8,9.6-21.3,21.3-21.3s21.8,9.6,21.8,21.3
		C821.8,279.9,811.7,289.4,800,289.4z"/>
	<path class="st22" d="M836,147.3h-43.1l-14.2,14.2v42.6l14.2,7.1H836l21.3-7.1v-38.4l-7.1-4.3L836,147.3z"/>
	<path class="st23" d="M778.7,133.1v28.4h71.5l7.1-3.7l-7.1-3.4v-21.3H778.7z"/>
	<path class="st18" d="M878.6,275.2H764.5v-7.1c0-27.5,22.7-49.7,50.2-49.7l11.8-7.1h66.3v52.1L878.6,275.2z"/>
	<path class="st24" d="M764.5,204.2h100v14.2h-100V204.2z"/>
	<path class="st25" d="M914.2,240.1v26.7l-7.1,8.4h-28.4v-56.9h-14.2c-7.8,0-14.2-6.4-14.2-14.2v-35.5h42.6v21.3
		c7.8,0,14.2,6.4,14.2,14.2v28.4L914.2,240.1z"/>
	<path class="st20" d="M914.2,240.1v26.7l-7.1,8.4h-28.4v-56.9h-7.1v-49.7h21.3v21.3c7.8,0,14.2,6.4,14.2,14.2v28.4L914.2,240.1z"/>
	<g>
		<path class="st18" d="M892.8,161.5v-7.1c0-11.8-9.6-21.3-21.3-21.3c-11.8,0-21.3,9.6-21.3,21.3v14.2c0,11.8,9.5,21.3,21.3,21.3
			h57.3c11.8,0,21.3-9.5,21.3-21.3v-7.1H892.8z"/>
		<path class="st19" d="M950.2,168.6v-7.1h-57.3v-7.1c0-11.8-9.6-21.3-21.3-21.3v56.9h57.3C940.6,189.9,950.2,180.4,950.2,168.6z"/>
	</g>
	<path class="st26" d="M878.6,97.1h-7.1h-7.1l-14.2,7.1v7.1c0,11.8,9.6,21.8,21.3,21.8c11.8,0,21.3-10,21.3-21.8v-7.1L878.6,97.1z"
		/>
	<path class="st27" d="M892.8,111.3v-7.1l-14.2-7.1h-7.1v36C883.3,133.1,892.8,123.1,892.8,111.3z"/>
	<path class="st20" d="M871.5,90h-21.3v14.2h21.3h35.5V90H871.5z"/>
	<path class="st24" d="M871.5,90h35.5v14.2h-35.5V90z"/>
	<path class="st19" d="M969.8,205.8c-0.8-5.5-2.3-16.4-5.4-38.1L936,154.4v56.9c0,11.2-9.7,21.3-21.8,21.3h-7.1v42.6h14.2h71.5
		l14.2-7.1v-14.2C1007,231.2,991.3,211.4,969.8,205.8z"/>
	<g>
		<path class="st18" d="M978.6,175.7h-21.3c-11.8,0-21.3-9.6-21.3-21.3c0-11.8,9.6-21.3,21.3-21.3h21.3V175.7z"/>
	</g>
	<path class="st24" d="M973.6,232.8l-2.1,7.9l-12-5.9c-13.7,4.9-23.6,17.9-23.6,33.3c0,19.6,15.9,35.5,35.5,35.5
		s35.5-15.9,35.5-35.5C1007,249.3,992.2,233.9,973.6,232.8z"/>
	<g>
		<path class="st28" d="M971.5,246.8c-11.8,0-21.3,9.6-21.3,21.3c0,11.8,9.6,21.3,21.3,21.3s21.3-9.6,21.3-21.3
			C992.8,256.4,983.3,246.8,971.5,246.8z"/>
	</g>
	<path class="st29" d="M978.5,267.1l-4.9-34.3c-0.7,0-1.4-0.2-2.1-0.2c-4.2,0-8.2,0.9-11.9,2.2l4.9,34.3L978.5,267.1z"/>
</g>
<polygon class="st30" points="543.1,296.6 519.7,396.6 543.1,520 654.8,520 654.8,296.6 "/>
<rect x="431.5" y="296.6" class="st31" width="111.7" height="223.4"/>
<g>
	<rect x="444.5" y="414.9" class="st32" width="85.5" height="92"/>
	<rect x="444.5" y="309.7" class="st32" width="85.5" height="92"/>
</g>
<g>
	<rect x="556.2" y="414.9" class="st33" width="85.5" height="92"/>
	<rect x="556.2" y="309.7" class="st33" width="85.5" height="92"/>
</g>
<rect x="615.6" y="375.4" class="st34" width="13.1" height="13.1"/>
<rect x="503.9" y="375.2" class="st2" width="13.1" height="13.1"/>
<rect x="615.6" y="480.7" class="st34" width="13.1" height="13.1"/>
<rect x="589.4" y="323" class="st30" width="39.3" height="39.3"/>
<rect x="477.7" y="322.8" class="st31" width="39.3" height="39.3"/>
<rect x="589.4" y="428.4" class="st30" width="39.3" height="39.3"/>
<rect x="477.7" y="428.2" class="st31" width="39.3" height="39.3"/>
<rect x="503.9" y="480.5" class="st2" width="13.1" height="13.1"/>
</svg>
