<?xml version="1.0" encoding="utf-8"?>
<!-- Generator: Adobe Illustrator 17.0.0, SVG Export Plug-In . SVG Version: 6.00 Build 0)  -->
<!DOCTYPE svg PUBLIC "-//W3C//DTD SVG 1.1//EN" "http://www.w3.org/Graphics/SVG/1.1/DTD/svg11.dtd">
<svg version="1.1" id="Layer_3" xmlns="http://www.w3.org/2000/svg" xmlns:xlink="http://www.w3.org/1999/xlink" x="0px" y="0px"
	 width="127px" height="149px" viewBox="0 0 127 149" enable-background="new 0 0 127 149" xml:space="preserve">
<g>
	<g>
		<path fill="#02519C" d="M44.443,93.665l-0.057-0.057c-0.764-0.761-2.001-0.758-2.762,0.007c-0.761,0.765-0.758,2.001,0.007,2.762
			l0.064,0.063c0.381,0.377,0.878,0.566,1.374,0.566c0.503,0,1.006-0.193,1.388-0.579C45.215,95.661,45.21,94.424,44.443,93.665z"/>
	</g>
</g>
<g>
	<g>
		<path fill="#02519C" d="M86.374,51.627c-12.337-12.337-32.41-12.337-44.747,0c-10.099,10.099-12.181,25.787-5.062,38.15
			c0.538,0.935,1.733,1.256,2.667,0.718c0.935-0.538,1.256-1.732,0.718-2.667c-6.239-10.835-4.414-24.586,4.439-33.439
			c10.814-10.814,28.409-10.814,39.222,0c10.814,10.814,10.814,28.409,0,39.222c-8.907,8.907-22.714,10.699-33.578,4.358
			c-0.932-0.544-2.128-0.229-2.671,0.702c-0.544,0.932-0.229,2.128,0.702,2.671c4.957,2.893,10.45,4.302,15.908,4.302
			c8.191,0,16.304-3.174,22.401-9.272C98.71,84.037,98.71,63.963,86.374,51.627z"/>
	</g>
</g>
<g>
	<g>
		<path fill="#02519C" d="M113.993,65.418c0-0.96-0.699-1.778-1.647-1.928l-7.21-1.142l-3.825-9.224l4.286-5.909
			c0.564-0.777,0.479-1.849-0.2-2.528L93.283,32.581c-0.679-0.679-1.752-0.763-2.529-0.199l-5.903,4.288l-9.23-3.819l-1.147-7.206
			C74.322,24.698,73.505,24,72.545,24c0,0-0.001,0-0.001,0l-17.126,0.007c-0.96,0-1.778,0.699-1.928,1.647l-1.142,7.21l-9.224,3.825
			l-5.909-4.286c-0.777-0.564-1.849-0.479-2.528,0.2L22.581,44.717c-0.679,0.679-0.763,1.752-0.199,2.529l4.288,5.903l-3.819,9.23
			l-7.206,1.147C14.698,63.678,14,64.496,14,65.456l0.007,17.125c0,0.96,0.699,1.778,1.647,1.928l7.21,1.142l3.825,9.224
			l-4.286,5.909c-0.564,0.777-0.479,1.849,0.2,2.528l12.113,12.105c0.679,0.679,1.752,0.763,2.529,0.199l5.903-4.288l9.23,3.819
			l1.147,7.206c0.151,0.948,0.969,1.646,1.929,1.646c0,0,0.001,0,0.001,0l17.125-0.007c0.96,0,1.778-0.699,1.928-1.647l1.142-7.21
			l9.224-3.825l5.909,4.286c0.777,0.564,1.849,0.479,2.528-0.2l12.105-12.113c0.679-0.679,0.763-1.752,0.199-2.529l-4.288-5.903
			l3.819-9.23l7.206-1.147c0.948-0.151,1.646-0.969,1.646-1.929L113.993,65.418z M103.454,81.935
			c-0.671,0.107-1.238,0.554-1.498,1.182l-4.655,11.251c-0.26,0.628-0.175,1.345,0.225,1.895l3.951,5.439l-9.748,9.755l-5.444-3.949
			c-0.55-0.399-1.267-0.483-1.895-0.223l-11.244,4.662c-0.627,0.26-1.075,0.828-1.181,1.498l-1.053,6.642l-13.79,0.006l-1.057-6.639
			c-0.107-0.671-0.554-1.238-1.182-1.498l-11.251-4.655c-0.24-0.1-0.494-0.148-0.746-0.148c-0.406,0-0.809,0.127-1.148,0.373
			l-5.439,3.951l-9.755-9.748l3.949-5.444c0.399-0.55,0.483-1.267,0.223-1.895l-4.662-11.244c-0.26-0.627-0.828-1.075-1.498-1.181
			l-6.643-1.053l-0.006-13.79l6.639-1.057c0.671-0.107,1.238-0.554,1.498-1.182l4.655-11.251c0.26-0.628,0.175-1.345-0.225-1.895
			l-3.951-5.439l9.748-9.755l5.444,3.949c0.55,0.399,1.267,0.484,1.895,0.223l11.244-4.663c0.627-0.26,1.075-0.828,1.181-1.498
			l1.052-6.643l13.791-0.006l1.057,6.639c0.107,0.671,0.554,1.238,1.182,1.498l11.251,4.655c0.628,0.259,1.345,0.175,1.895-0.225
			l5.439-3.951l9.755,9.748l-3.949,5.444c-0.399,0.55-0.483,1.267-0.223,1.895l4.662,11.244c0.26,0.627,0.828,1.075,1.498,1.181
			l6.643,1.053l0.006,13.79L103.454,81.935z"/>
	</g>
</g>
<g>
	<g>
		<path fill="#02519C" d="M81.793,76.433c-2.443-2.219-5.726-3.183-8.966-2.679l-8.578-8.578c0.522-3.398-0.599-6.894-3.055-9.35
			c-3.079-3.079-7.683-4.022-11.729-2.403c-0.61,0.244-1.056,0.778-1.188,1.421c-0.132,0.643,0.068,1.309,0.532,1.774l2.832,2.832
			c0.599,0.599,0.599,1.575,0,2.174c-0.599,0.6-1.575,0.6-2.174,0l-2.842-2.842c-0.463-0.463-1.127-0.664-1.77-0.533
			c-0.642,0.13-1.176,0.574-1.422,1.181c-1.703,4.205-0.589,9.083,2.772,12.136c2.445,2.222,5.731,3.186,8.975,2.678l8.57,8.57
			c-0.525,3.4,0.595,6.9,3.054,9.359c2.081,2.081,4.853,3.186,7.68,3.186c1.371,0,2.756-0.26,4.08-0.795
			c0.608-0.245,1.052-0.779,1.182-1.421c0.131-0.642-0.069-1.307-0.533-1.771l-2.819-2.819c-0.599-0.599-0.599-1.575,0-2.174
			s1.575-0.6,2.174,0l2.813,2.813c0.464,0.464,1.13,0.664,1.773,0.532c0.643-0.132,1.177-0.577,1.421-1.186
			C86.262,84.341,85.143,79.477,81.793,76.433z M81.333,83.616c-2.123-2.122-5.576-2.123-7.699,0s-2.122,5.576,0,7.699l0.095,0.096
			c-1.542-0.169-3.016-0.853-4.162-1.999c-1.752-1.752-2.443-4.33-1.803-6.729c0.18-0.674-0.013-1.392-0.506-1.885L57.198,70.737
			c-0.371-0.371-0.87-0.572-1.381-0.572c-0.167,0-0.335,0.021-0.501,0.065c-2.313,0.614-4.737,0.033-6.483-1.554
			c-1.283-1.166-2.055-2.746-2.24-4.402l0.112,0.112c2.123,2.122,5.576,2.123,7.699,0c2.122-2.123,2.122-5.576,0-7.699l-0.092-0.092
			c1.527,0.177,2.986,0.859,4.12,1.994c1.75,1.75,2.441,4.326,1.804,6.723c-0.179,0.673,0.014,1.391,0.506,1.883L70.81,77.262
			c0.492,0.492,1.207,0.685,1.88,0.507c2.311-0.611,4.732-0.029,6.477,1.556c1.271,1.155,2.041,2.718,2.235,4.36L81.333,83.616z"/>
	</g>
</g>
<g>
	<g>
		<path fill="#02519C" d="M81.84,60.053c-3.219-4.112-7.782-7.004-12.85-8.145c-1.052-0.237-2.097,0.424-2.334,1.477
			c-0.237,1.053,0.424,2.097,1.477,2.334c4.191,0.943,7.966,3.337,10.631,6.742c0.385,0.492,0.959,0.749,1.539,0.749
			c0.421,0,0.845-0.136,1.203-0.415C82.356,62.13,82.505,60.902,81.84,60.053z"/>
	</g>
</g>
<g>
	<g>
		<path fill="#02519C" d="M85.572,67.096l-0.029-0.088c-0.331-1.027-1.432-1.589-2.459-1.258c-1.027,0.331-1.59,1.432-1.258,2.459
			l0.025,0.077c0.265,0.83,1.033,1.359,1.86,1.359c0.197,0,0.397-0.03,0.595-0.093C85.333,69.222,85.9,68.123,85.572,67.096z"/>
	</g>
</g>
</svg>
