[
  {
    "name": "curl",
    "post": ""
  },
  {
    "name": "fzf",
    "post": "chmod +x $(brew --prefix)/opt/fzf/install; $(brew --prefix)/opt/fzf/install"
  },
  {
    "name": "git",
    "post": ""
  },
  {
    "name": "jq",
    "post": ""
  },
  {
    "name": "neovim",
    "post": "chmod +x ./vim_setup.sh; ./vim_setup.sh"
  },
  {
    "name": "nmap",
    "post": ""
  },
  {
    "name": "radare2",
    "post": ""
  },
  {
    "name": "ripgrep",
    "post": ""
  },
  {
    "name": "telnet",
    "post": ""
  },
  {
    "name": "texlab",
    "post": ""
  },
  {
    "name": "tmux",
    "post": "git clone https://github.com/gpakosz/.tmux.git; ln -s -f .tmux/.tmux.conf ~/.tmux.conf;"
  },
  {
    "name": "htop",
    "post": ""
  },
  {
    "name": "zsh",
    "post": "chsh -s /bin/zsh; sh -c '$(curl -fsSL https://raw.githubusercontent.com/ohmyzsh/ohmyzsh/master/tools/install.sh)'"
  },
  {
    "name": "zsh-completions",
    "post": ""
  }
]
