// Jest Snapshot v1, https://goo.gl/fbAQLP

exports[`FriendModal: should invoke addFriend if the form is valid and should reset form 1`] = `
Object {
  "age": undefined,
  "name": "test",
  "photo": "test",
}
`;
