<svg version="1.1" xmlns="http://www.w3.org/2000/svg" viewBox="0 0 1925.54296875 948.53125" width="3851.0859375" height="1897.0625">
  <!-- svg-source:excalidraw -->
  
  <defs>
    <style>
      @font-face {
        font-family: "Virgil";
        src: url("https://excalidraw.com/Virgil.woff2");
      }
      @font-face {
        font-family: "Cascadia";
        src: url("https://excalidraw.com/Cascadia.woff2");
      }
    </style>
  </defs>
  <rect x="0" y="0" width="1925.54296875" height="948.53125" fill="#ffffff"></rect><g stroke-linecap="round" transform="translate(407.484375 170.34765625) rotate(0 148.646484375 57.765625)"><path d="M1.29 -0.03 C111.58 -2.03, 224.64 -1.27, 298.09 -1.12 M-0.42 0.32 C114.59 1.88, 229.34 0.97, 297.7 -0.01 M298.98 -1.39 C295.51 31.49, 294.65 57.79, 297.55 114.18 M296.8 -0.61 C296.83 33.37, 295.86 67.57, 296.55 116.31 M298.61 115.24 C217.09 117.66, 136.54 116.9, -0.81 115.18 M297.41 115.93 C214.46 116.43, 133.12 117.12, 0.38 116.04 M0.23 115.95 C1.32 89.93, -0.19 63.35, 1.52 -1.6 M0.51 115.47 C-0.48 76.41, -1.81 36.32, 0.96 0.14" stroke="#000000" stroke-width="1" fill="none"></path></g><g transform="translate(452.35546875 224.7890625) rotate(0 105 12)"><text x="0" y="17" font-family="Virgil, Segoe UI Emoji" font-size="19.22697368421053px" fill="#000000" text-anchor="start" style="white-space: pre;" direction="ltr">message-producer API</text></g><g stroke-linecap="round"><g transform="translate(264.58984375 234.31260192357593) rotate(0 69.96277075260878 0.08079422205830156)"><path d="M-0.8 0.61 C22.58 0.6, 117.1 1.17, 140.72 0.96 M0.99 -0.11 C24.16 0.05, 116.52 -0.89, 139.74 -0.84" stroke="#000000" stroke-width="1" fill="none"></path></g><g transform="translate(264.58984375 234.31260192357593) rotate(0 69.96277075260878 0.08079422205830156)"><path d="M112.61 9.43 C122.08 6.49, 128.98 1.29, 141.66 -0.57 M110.95 9.6 C122.19 5.76, 132.56 3.24, 139.42 -1.4" stroke="#000000" stroke-width="1" fill="none"></path></g><g transform="translate(264.58984375 234.31260192357593) rotate(0 69.96277075260878 0.08079422205830156)"><path d="M112.52 -11.09 C122.19 -7.06, 129.12 -5.28, 141.66 -0.57 M110.86 -10.92 C122.23 -7.43, 132.63 -2.61, 139.42 -1.4" stroke="#000000" stroke-width="1" fill="none"></path></g></g><g transform="translate(10 10) rotate(0 122 112.5)"><text x="0" y="18" font-family="Virgil, Segoe UI Emoji" font-size="20px" fill="#000000" text-anchor="start" style="white-space: pre;" direction="ltr">{</text><text x="0" y="43" font-family="Virgil, Segoe UI Emoji" font-size="20px" fill="#000000" text-anchor="start" style="white-space: pre;" direction="ltr">  "ts": "1530228285",</text><text x="0" y="68" font-family="Virgil, Segoe UI Emoji" font-size="20px" fill="#000000" text-anchor="start" style="white-space: pre;" direction="ltr">  "sender": "sai",</text><text x="0" y="93" font-family="Virgil, Segoe UI Emoji" font-size="20px" fill="#000000" text-anchor="start" style="white-space: pre;" direction="ltr">  "message": {</text><text x="0" y="118" font-family="Virgil, Segoe UI Emoji" font-size="20px" fill="#000000" text-anchor="start" style="white-space: pre;" direction="ltr">    "foo": "bar"</text><text x="0" y="143" font-family="Virgil, Segoe UI Emoji" font-size="20px" fill="#000000" text-anchor="start" style="white-space: pre;" direction="ltr">  },</text><text x="0" y="168" font-family="Virgil, Segoe UI Emoji" font-size="20px" fill="#000000" text-anchor="start" style="white-space: pre;" direction="ltr">  "sent-from-ip": "1.2.3.4",</text><text x="0" y="193" font-family="Virgil, Segoe UI Emoji" font-size="20px" fill="#000000" text-anchor="start" style="white-space: pre;" direction="ltr">  "priority": 3</text><text x="0" y="218" font-family="Virgil, Segoe UI Emoji" font-size="20px" fill="#000000" text-anchor="start" style="white-space: pre;" direction="ltr">}</text></g><g stroke-linecap="round" transform="translate(937.5390625 115.73046875) rotate(0 95.736328125 189.064453125)"><path d="M0.91 -1.13 C39.47 -0.82, 80.94 1.44, 190.61 -1.17 M0.32 -0.64 C66.54 0.29, 132.15 0.35, 192.18 0.2 M190.29 -0.07 C190.28 104.68, 191.41 210.16, 190.53 377.09 M191.25 0.05 C192.13 96.68, 191.96 194.05, 191.15 378.49 M190.62 378.25 C135.14 378.31, 78.02 377.18, -0.01 376.68 M191.39 377.2 C129.38 376.89, 66.91 375.96, -0.48 378.87 M1.18 378.9 C-1.28 260.06, -2.09 142.44, -0.11 -0.63 M-0.33 378.64 C0.03 252.18, -0.39 126.26, 0.2 -0.55" stroke="#000000" stroke-width="1" fill="none"></path></g><g transform="translate(991.9609375 222.90234375) rotate(0 49.5 37.5)"><text x="0" y="18" font-family="Virgil, Segoe UI Emoji" font-size="20px" fill="#000000" text-anchor="start" style="white-space: pre;" direction="ltr">Redis </text><text x="0" y="43" font-family="Virgil, Segoe UI Emoji" font-size="20px" fill="#000000" text-anchor="start" style="white-space: pre;" direction="ltr">based </text><text x="0" y="68" font-family="Virgil, Segoe UI Emoji" font-size="20px" fill="#000000" text-anchor="start" style="white-space: pre;" direction="ltr">bull queue</text></g><g stroke-linecap="round"><g transform="translate(707.2421875 231.30859375) rotate(0 112.39023524148854 -0.12651388076133685)"><path d="M0.37 -0.62 C37.89 -0.66, 188.45 -0.09, 225.67 0.06 M-0.89 1.67 C36.48 1.22, 187.33 -1.35, 225.15 -1.92" stroke="#000000" stroke-width="1" fill="none"></path></g><g transform="translate(707.2421875 231.30859375) rotate(0 112.39023524148854 -0.12651388076133685)"><path d="M196.1 10.15 C207.33 3.09, 217.48 2.57, 224.5 -0.73 M196.97 9.51 C203.04 6.42, 208.98 3.34, 224.84 -2.32" stroke="#000000" stroke-width="1" fill="none"></path></g><g transform="translate(707.2421875 231.30859375) rotate(0 112.39023524148854 -0.12651388076133685)"><path d="M195.77 -10.37 C207.16 -10.28, 217.43 -3.64, 224.5 -0.73 M196.64 -11.01 C202.77 -9.64, 208.77 -8.26, 224.84 -2.32" stroke="#000000" stroke-width="1" fill="none"></path></g></g><g transform="translate(752.03125 175.45703125) rotate(0 56 25)"><text x="0" y="18" font-family="Virgil, Segoe UI Emoji" font-size="20px" fill="#000000" text-anchor="start" style="white-space: pre;" direction="ltr">send data </text><text x="0" y="43" font-family="Virgil, Segoe UI Emoji" font-size="20px" fill="#000000" text-anchor="start" style="white-space: pre;" direction="ltr">to queue</text></g><g transform="translate(462.0859375 125.31640625) rotate(0 92.5 12.5)"><text x="0" y="18" font-family="Virgil, Segoe UI Emoji" font-size="20px" fill="#000000" text-anchor="start" style="white-space: pre;" direction="ltr">validation of data</text></g><g stroke-linecap="round" transform="translate(1382.8671875 386.1015625) rotate(0 162.53125 65.626953125)"><path d="M-0.72 0.02 C93.5 1.34, 184.08 0.83, 325.1 -0.76 M-0.24 -0.1 C124.49 -0.63, 248.75 -0.27, 324.41 -0.25 M323.17 1.51 C326.43 32.65, 323.49 65.49, 324.28 129.73 M325.66 0.2 C324.57 28.61, 325.66 55.56, 324.4 130.35 M325.97 131.39 C259.73 133.35, 193.29 131.64, 0.56 130.5 M325.23 131.01 C246.9 133.2, 168.75 133.35, -0.13 131.15 M0.41 132.51 C1.73 96.7, -1.18 62.44, 0.76 -0.55 M-0.54 132.06 C0.01 80.32, 1.52 30.81, 0 -0.19" stroke="#000000" stroke-width="1" fill="none"></path></g><g transform="translate(1441.9609375 440.9296875) rotate(0 110.5 12.5)"><text x="0" y="18" font-family="Virgil, Segoe UI Emoji" font-size="20px" fill="#000000" text-anchor="start" style="white-space: pre;" direction="ltr">message-consumer API</text></g><g stroke-linecap="round"><g transform="translate(1131.46484375 466.94921875) rotate(0 126.81209728270767 -2.0251132920384407)"><path d="M-0.87 0.56 C41.54 -0.4, 211.77 -3.71, 254.5 -4.61 M0.87 -0.19 C43.08 -0.46, 210.93 -2.6, 253.27 -3.19" stroke="#000000" stroke-width="1" fill="none"></path></g><g transform="translate(1131.46484375 466.94921875) rotate(0 126.81209728270767 -2.0251132920384407)"><path d="M226.16 6.57 C233.16 5.22, 241.21 0.26, 252.79 -5.15 M225.71 6.72 C230.69 5.65, 236.79 3.26, 252.67 -4.18" stroke="#000000" stroke-width="1" fill="none"></path></g><g transform="translate(1131.46484375 466.94921875) rotate(0 126.81209728270767 -2.0251132920384407)"><path d="M225.89 -13.95 C233.17 -9.15, 241.29 -7.97, 252.79 -5.15 M225.44 -13.79 C230.39 -10.66, 236.55 -8.84, 252.67 -4.18" stroke="#000000" stroke-width="1" fill="none"></path></g></g><g transform="translate(1148.33203125 401.3359375) rotate(0 112 25)"><text x="0" y="18" font-family="Virgil, Segoe UI Emoji" font-size="20px" fill="#000000" text-anchor="start" style="white-space: pre;" direction="ltr">read from queue</text><text x="0" y="43" font-family="Virgil, Segoe UI Emoji" font-size="20px" fill="#000000" text-anchor="start" style="white-space: pre;" direction="ltr">when a new job arrives</text></g><g stroke-linecap="round" transform="translate(941.296875 642.69140625) rotate(0 98.1875 147.919921875)"><path d="M1.86 0.83 C42.54 2.6, 84.64 0.74, 195.72 1.23 M-0.23 -0.21 C70.72 -2.02, 142.18 -0.94, 196.52 -0.48 M196.31 -0.61 C196.93 60.38, 198.4 122.5, 195.89 296.77 M196.13 0.18 C196.31 67.71, 197.3 135.67, 196.9 295.84 M195.16 296.89 C133.98 297.57, 75.1 297.57, -1.32 297.55 M196.29 294.95 C141.33 298.32, 86.81 297.36, -0.89 295.35 M-0.22 295.98 C-0.34 217.24, -1.92 136.96, -0.12 -0.82 M0.24 295.59 C-0.57 219.27, -0.55 142.9, 0.6 0.52" stroke="#000000" stroke-width="1" fill="none"></path></g><g transform="translate(994.2109375 764.1875) rotate(0 42 25)"><text x="0" y="18" font-family="Virgil, Segoe UI Emoji" font-size="20px" fill="#000000" text-anchor="start" style="white-space: pre;" direction="ltr">postgres</text><text x="0" y="43" font-family="Virgil, Segoe UI Emoji" font-size="20px" fill="#000000" text-anchor="start" style="white-space: pre;" direction="ltr">   DB</text></g><g stroke-linecap="round" transform="translate(1435.06640625 672.390625) rotate(0 88.181640625 77.955078125)"><path d="M128.57 8.29 C139.32 11.82, 148.65 20.74, 156.27 28.9 C163.89 37.06, 171.09 46.91, 174.29 57.23 C177.5 67.56, 177.67 80.36, 175.5 90.84 C173.33 101.32, 167.9 111.4, 161.28 120.12 C154.66 128.83, 145.72 137.42, 135.76 143.15 C125.8 148.88, 113.32 152.73, 101.51 154.5 C89.7 156.27, 76.28 156.55, 64.9 153.75 C53.51 150.95, 42.41 144.63, 33.2 137.72 C23.98 130.81, 15.08 121.61, 9.62 112.3 C4.16 103, 0.96 92.19, 0.43 81.89 C-0.1 71.59, 2.05 60.36, 6.45 50.49 C10.84 40.62, 18.33 30.33, 26.82 22.66 C35.31 14.98, 46.29 8.15, 57.38 4.44 C68.47 0.73, 80.27 -1, 93.34 0.4 C106.41 1.79, 127.58 9.98, 135.79 12.8 C144 15.61, 143.38 16.22, 142.61 17.27 M108.35 0.82 C119.59 2.03, 131.37 10.42, 141.02 17.22 C150.68 24.03, 160.64 32.53, 166.28 41.65 C171.91 50.77, 174.16 61.78, 174.83 71.93 C175.5 82.08, 174.21 92.58, 170.3 102.52 C166.38 112.47, 159.16 123.66, 151.33 131.62 C143.49 139.57, 134.26 146.3, 123.29 150.28 C112.33 154.26, 97.54 155.9, 85.53 155.49 C73.51 155.09, 61.78 152.28, 51.23 147.87 C40.67 143.46, 30.31 136.75, 22.21 129.04 C14.11 121.34, 6.18 111.66, 2.64 101.62 C-0.91 91.57, -0.97 79.61, 0.96 68.78 C2.89 57.95, 8.26 45.86, 14.22 36.64 C20.19 27.41, 27.06 19.07, 36.75 13.44 C46.43 7.8, 60.49 4.51, 72.33 2.84 C84.18 1.16, 101.99 3.52, 107.81 3.4 C113.63 3.28, 107.44 1.3, 107.27 2.1" stroke="#000000" stroke-width="1" fill="none"></path></g><g transform="translate(1490.8515625 729.5234375) rotate(0 30 25)"><text x="0" y="18" font-family="Virgil, Segoe UI Emoji" font-size="20px" fill="#000000" text-anchor="start" style="white-space: pre;" direction="ltr">prisma</text><text x="0" y="43" font-family="Virgil, Segoe UI Emoji" font-size="20px" fill="#000000" text-anchor="start" style="white-space: pre;" direction="ltr"> ORM</text></g><g stroke-linecap="round"><g transform="translate(1522.57421875 518.85546875) rotate(0 2.1658010050654184 79.52830392102715)"><path d="M-0.37 1.08 C0.32 27.14, 3.71 131.45, 4.7 157.54 M1.64 0.6 C2.07 27.27, 2.94 132.18, 3.5 158.46" stroke="#000000" stroke-width="1" fill="none"></path></g><g transform="translate(1522.57421875 518.85546875) rotate(0 2.1658010050654184 79.52830392102715)"><path d="M-5.36 129.61 C-5.12 140.87, -1.37 148.61, 5.34 156.85 M-7.79 129.83 C-3.3 140.97, 2.12 151.77, 3.19 159.05" stroke="#000000" stroke-width="1" fill="none"></path></g><g transform="translate(1522.57421875 518.85546875) rotate(0 2.1658010050654184 79.52830392102715)"><path d="M15.16 129.32 C8.25 140.62, 4.87 148.46, 5.34 156.85 M12.73 129.54 C9.11 140.79, 6.41 151.71, 3.19 159.05" stroke="#000000" stroke-width="1" fill="none"></path></g></g><g stroke-linecap="round"><g transform="translate(1426.671875 758.3515625) rotate(0 -144.0726613524696 -0.14523585567980035)"><path d="M0.61 -1.16 C-47.5 -1.2, -239.62 -0.95, -287.88 -0.94 M-0.53 0.85 C-48.86 1.01, -241.09 0.41, -288.76 0.22" stroke="#000000" stroke-width="1" fill="none"></path></g><g transform="translate(1426.671875 758.3515625) rotate(0 -144.0726613524696 -0.14523585567980035)"><path d="M-262.46 -9.72 C-272.12 -7.61, -282.77 -1.85, -288.53 0.76 M-260.21 -10.55 C-270.07 -7.34, -278.4 -3.74, -287.95 0.59" stroke="#000000" stroke-width="1" fill="none"></path></g><g transform="translate(1426.671875 758.3515625) rotate(0 -144.0726613524696 -0.14523585567980035)"><path d="M-262.53 10.8 C-272.05 5.38, -282.67 3.61, -288.53 0.76 M-260.28 9.98 C-269.97 6.7, -278.28 3.82, -287.95 0.59" stroke="#000000" stroke-width="1" fill="none"></path></g></g><g transform="translate(1556.54296875 588.77734375) rotate(0 179.5 12.5)"><text x="0" y="18" font-family="Virgil, Segoe UI Emoji" font-size="20px" fill="#000000" text-anchor="start" style="white-space: pre;" direction="ltr">Message is sent to DB for storage</text></g></svg>