{
  "$schema": "./node_modules/nx/schemas/workspace-schema.json",
  "version": 2,
  "projects": {
    "config": "libs/config",
    "custom-validators": "libs/custom-validators",
    "message-consumer": "apps/message-consumer",
    "message-producer": "apps/message-producer",
    "prisma": "libs/prisma"
  }
}
