{
    "type": "service_account",
    "project_id": "muhamadsahyudi-352107",
    "private_key_id": "0ae5340843011da2196c9d778bef2cd538ece0e2",
    "private_key": "-----BEGIN PRIVATE KEY-----\nMIIEvwIBADANBgkqhkiG9w0BAQEFAASCBKkwggSlAgEAAoIBAQD4xCxwfrChKx/F\n9dO8hV28NPioagaPnTxwEBS7Ogi4RaXeRuaE9jU4m8zQRS5zDvXw2hVU0gFehsm5\n6euYaRlxZ6yiNHGK2TUUj8RarOFseGJq55ECeohcBJja8qApWGktdtGc490XGCkM\n4fE0wtIv9ii5ve+4fIUfLw7DBKID8YpE9Ju3J+P8RxQ4Fhqvu0f9TZUct6FckH3p\n3rTnvFJJMO9rj/5iNRrC1KpfIwaxHz69lrz8stl1O6FVoud0ZaNDhMMfNc70ef9a\nj5OVcO42urbds4VocUVuau5E3VGCKqHwiDWgr+QLw9JWKVaxUSEZ5UgwUkcTjEeP\nDF1MhWenAgMBAAECggEAZq8zWMwyxJQ0bVZnrC2w33tOGNaLFsTkqa05oX73EnlN\nWk8R4Fhw54kIJgAoiD3orx6WJ4j4H7irlB5GrYbUhccxr1LOe23lRzOA7ZznAAtB\nNLeZV9iUaMdNATOdgPOJlsaxB33XSS0j5LlvA0RX1oxZizInvZNIr/KQuVc0OUOu\nYXBWATX62rYC9lAd30vUTFkcR/RMRU8XYGkMpD2sh4g68ILVLVYTGVAxw1cCeAVQ\nahB8KCq1xWVSogddPSvOTJk0mHxeV95eRTlNEMz7TLXOfXqCBGaSgu0hfKKLpzKD\nNaenXCq4Y21LDLvdRtmmxjruJlJNZ0kYhPi3kLKK4QKBgQD/cU9fRfPKra18BITm\nOCpvi4h5MBEkEZgwLrR7CUVd3DIXKPr4URTAMQ2FW1c8hpme0X441XA3UTmie60d\nRtmWaPEiNfTJOG8NiNV+quKnd7sR1GTr4gnKWHzYhPYYtnSQidPKqKbazyqj61d9\n2DMsP+oslTukDO0JsXR+iSMdGwKBgQD5TyJYegX+Rf/IKHwoK53VOaiP26/MlGks\nxA5ulgeo3BZAnSXLqHhIQR6rZcCbH7xk1u1rIFgKMpb8GCI8c31UlNso00pFBcYR\n2MWHjZtywM4aRiCc8S6ZFsQj0HHWP3H8RxIEziZxT+zjhllhNPVmhnYDVIavMxNg\nZ+WAa4uEZQKBgQC4miikT6dpt64CTDnHLpvsVMhh3Ezm5hg36ejgacjJlhJVDnag\n8eevJUQCNgqLYTKvxfIUHJumPnsKY5qt57/jpR9ue9PVf4UyIMs5aUG3iR2WOwpc\nNdSheOVwjFZVcbY3poN6l/tNch38rF1kQtRojCAt7ANYAUdkk+v+bhkENQKBgQCl\nse+MyETVc2aFfErQU/TJc1HRktvrZzPjucYxv2sF0ojDlu44xhZzRzyAA9eYAeav\nSp1u1odM98SbddrDPKqunWRvZMZ2y1iSIfVem0IWaYhRtAwW4sDqpFPlzbLrBy3V\n0tJp+S1ZoBo8Od2LmqwC4RjsK7B8HsEhEMxapp+KdQKBgQDRjRCA/4oNwQlwZwPW\nvfs3XUBH5E0GOkUQ1WLMZZeKhRYj/d1CW2fpIboT4cBY4KrkRSUGNQmvBkdwCYSR\n/u97C+8tp1XqlS+jaMcJhnNObw2Xnq6g1e9uuBU6yYjD3RylT68Uu0YzuJ7TA7WC\n8E/5oD3riAF32Yv/C1MKc/Y+bw==\n-----END PRIVATE KEY-----\n",
    "client_email": "upload-image@muhamadsahyudi-352107.iam.gserviceaccount.com",
    "client_id": "111067911278765475189",
    "auth_uri": "https://accounts.google.com/o/oauth2/auth",
    "token_uri": "https://oauth2.googleapis.com/token",
    "auth_provider_x509_cert_url": "https://www.googleapis.com/oauth2/v1/certs",
    "client_x509_cert_url": "https://www.googleapis.com/robot/v1/metadata/x509/upload-image%40muhamadsahyudi-352107.iam.gserviceaccount.com"
}