<svg xmlns="http://www.w3.org/2000/svg" xmlns:xlink="http://www.w3.org/1999/xlink" width="46.219" height="46.309" viewBox="0 0 46.219 46.309">
  <defs>
    <filter id="Mask" x="0" y="0" width="46.219" height="46.309" filterUnits="userSpaceOnUse">
      <feOffset dy="1" input="SourceAlpha"/>
      <feGaussianBlur stdDeviation="2.5" result="blur"/>
      <feFlood flood-opacity="0.173"/>
      <feComposite operator="in" in2="blur"/>
      <feComposite in="SourceGraphic"/>
    </filter>
  </defs>
  <g id="Group_195" data-name="Group 195" transform="translate(-58.223 -2.335)">
    <g id="Group_37_Copy_15" data-name="Group 37 Copy 15" transform="translate(65.723 8.835)">
      <g transform="matrix(1, 0, 0, 1, -7.5, -6.5)" filter="url(#Mask)">
        <path id="Mask-2" data-name="Mask" d="M15.61,0A15.655,15.655,0,1,1,0,15.654,15.632,15.632,0,0,1,15.61,0Z" transform="translate(7.5 6.5)" fill="#ef3e3e"/>
      </g>
    </g>
    <path id="Icon_material-close" data-name="Icon material-close" d="M17.385,8.5l-1-1-3.947,3.947L8.5,7.5l-1,1,3.947,3.947L7.5,16.39l1,1,3.947-3.947,3.947,3.947,1-1-3.947-3.947Z" transform="translate(69.5 11.5)" fill="#fff"/>
  </g>
</svg>
