<svg id="noun_Birth_2376627" xmlns="http://www.w3.org/2000/svg" width="23.575" height="24.395" viewBox="0 0 23.575 24.395">
  <g id="Group_299" data-name="Group 299" transform="translate(0 0)">
    <path id="Path_1168" data-name="Path 1168" d="M24.03,4.015H21.539v-.9a.616.616,0,1,0-1.233,0v.873H11.344V3.116a.616.616,0,0,0-1.233,0v.873H7.6A3.622,3.622,0,0,0,4,7.584V23.326A3.578,3.578,0,0,0,7.569,26.9H24a3.578,3.578,0,0,0,3.569-3.569V7.584A3.508,3.508,0,0,0,24.03,4.015ZM7.6,5.248h2.491v.873a.616.616,0,0,0,1.233,0V5.248h8.962v.873a.616.616,0,1,0,1.233,0V5.248H24.03a2.345,2.345,0,0,1,2.337,2.337V8.663H5.258V7.584A2.345,2.345,0,0,1,7.6,5.248ZM24.03,25.637H7.6A2.345,2.345,0,0,1,5.258,23.3V9.921H26.367v13.4A2.323,2.323,0,0,1,24.03,25.637Z" transform="translate(-4 -2.5)" fill="#72808a"/>
    <path id="Path_1169" data-name="Path 1169" d="M36.184,49.112h-.462V45.979a1.951,1.951,0,0,0-1.952-1.952h-2.44V42.975a1,1,0,0,0-1-1h-.18v-.437a1.591,1.591,0,0,0,.976-1.489,2.914,2.914,0,0,0-.924-1.772.792.792,0,0,0-1.156,0l-.077.1a2.818,2.818,0,0,0-.847,1.695,1.591,1.591,0,0,0,.976,1.489V42h-.154a1,1,0,0,0-1,1v1.053H25.527A1.951,1.951,0,0,0,23.576,46v3.133h-.462a.514.514,0,1,0,0,1.027h13.1a.515.515,0,0,0,.514-.514A.56.56,0,0,0,36.184,49.112Zm-6.548-9.938a1.864,1.864,0,0,1,.462.847.472.472,0,1,1-.924,0A1.746,1.746,0,0,1,29.636,39.174ZM28.968,43l1.284-.026v1.053H28.968Zm-3.441,2.08h8.217a.921.921,0,0,1,.924.924v.462a1.32,1.32,0,0,0-1.464.026l-.488.36a.27.27,0,0,1-.334,0l-.514-.36a1.31,1.31,0,0,0-1.541,0l-.488.36a.27.27,0,0,1-.334,0l-.514-.36a1.31,1.31,0,0,0-1.541,0l-.514.36a.27.27,0,0,1-.334,0l-.514-.36a1.362,1.362,0,0,0-1.489-.026v-.488A.9.9,0,0,1,25.527,45.08ZM24.6,47.7c.026,0,.026,0,.051-.026l.488-.36a.27.27,0,0,1,.334,0l.488.36a1.359,1.359,0,0,0,.77.231,1.212,1.212,0,0,0,.77-.257l.514-.36a.27.27,0,0,1,.334,0l.514.36a1.31,1.31,0,0,0,1.541,0l.488-.36a.27.27,0,0,1,.334,0l.514.36a1.31,1.31,0,0,0,1.541,0l.488-.36a.27.27,0,0,1,.334,0l.514.36h.026v1.387H24.6Z" transform="translate(-17.824 -28.903)" fill="#72808a"/>
  </g>
</svg>
