<svg xmlns="http://www.w3.org/2000/svg" xmlns:xlink="http://www.w3.org/1999/xlink" width="576" height="812" viewBox="0 0 576 812">
  <defs>
    <clipPath id="clip-Oboarding-1">
      <rect width="576" height="812"/>
    </clipPath>
  </defs>
  <g id="Oboarding-1" clip-path="url(#clip-Oboarding-1)">
    <rect width="576" height="812" fill="#ED1C24"/>
    <path id="Path_3" data-name="Path 3" d="M0,0S90.1,75.149,193.645,79.78,315.081,37.71,384.993,18.855,528.972,7.694,593.141,57.124" transform="translate(-17.141 2.686)" fill="none" stroke="#3347ff" stroke-miterlimit="10" stroke-width="3" opacity="0.967"/>
    <path id="Path_38" data-name="Path 38" d="M3575.133-3090.1s66.071-72.222,168.741-44.6,144.9-21.721,144.9-21.721,73.672-73.608,182.256-18.625,130.239,84.941,130.239,84.941" transform="translate(-3613 3202.729)" fill="none" stroke="#ffa100" stroke-width="1"/>
    <path id="Path_39" data-name="Path 39" d="M3588.709-2524.677s-35.918-136.036,117.034-129.142,176.518-49.525,187.518-61.508,61.964-98.532,159.02-91.063,115.827-24.024,115.827-24.024" transform="translate(-4109.717 2255.288) rotate(13)" fill="none" stroke="#ffa100" stroke-width="1"/>
    <path id="Path_40" data-name="Path 40" d="M3590.257-2528.4s-66.656-199.655,74.348-110.711,248.184,3.538,289.177-53.158,62.714,30.6,156.212-103.438,42.6-29.424,42.6-29.424" transform="translate(-4219.721 1888.282) rotate(17)" fill="none" stroke="#3345fd" stroke-width="3"/>
    <path id="Path_41" data-name="Path 41" d="M163.8,31.8A94.355,94.355,0,1,1,23.187,156.867C23.187,157.382,162.542,31.076,163.8,31.8Z" transform="translate(-125 519.047)" fill="#ef3e8b"/>
    <path id="Path_44" data-name="Path 44" d="M3669.084-3168.255l81.046,27.213-63.218,55.98Z" transform="translate(-3662 3118)" fill="#3347ff"/>
    <rect id="Rectangle_9" data-name="Rectangle 9" width="106" height="89" transform="translate(527.483 -55.07) rotate(-11)" fill="#ffa100"/>
    <path id="Path_43" data-name="Path 43" d="M40.358,5.679C40.347,5.668,101.109,66.13,100,67.5c1.635,2.245-59.943,62.161-58.547,62.291h0A67.529,67.529,0,0,1,40.358,5.679C48.521,2.059,40.357,5.682,40.358,5.679Z" transform="translate(241 775)" fill="#3347ff"/>
  </g>
</svg>
