<svg xmlns="http://www.w3.org/2000/svg" width="20" height="13.333" viewBox="0 0 20 13.333">
  <g id="noun_Email_1254030" transform="translate(-5 -20)">
    <g id="Group_177" data-name="Group 177" transform="translate(5 20)">
      <path id="Path_2540" data-name="Path 2540" d="M6.778,972.362A1.784,1.784,0,0,0,5,974.14v9.778A1.784,1.784,0,0,0,6.778,985.7H23.222A1.784,1.784,0,0,0,25,983.918V974.14a1.784,1.784,0,0,0-1.778-1.778Zm0,.889H23.222a.877.877,0,0,1,.889.889v9.778a.877.877,0,0,1-.889.889H6.778a.877.877,0,0,1-.889-.889V974.14A.877.877,0,0,1,6.778,973.251ZM22.1,975.008a.444.444,0,0,0-.278.132l-6.153,5.41a1.013,1.013,0,0,1-1.347,0l-6.139-5.41a.443.443,0,1,0-.583.667l3.75,3.313L7.6,982.237a.446.446,0,1,0,.569.688l3.854-3.208,1.7,1.5a1.911,1.911,0,0,0,2.521,0l1.715-1.507,3.861,3.215a.446.446,0,1,0,.569-.687l-3.75-3.125,3.757-3.306a.444.444,0,0,0-.306-.8Z" transform="translate(-5 -972.362)" fill="#72808a"/>
    </g>
  </g>
</svg>
