<!-- Generator: Adobe Illustrator 19.0.0, SVG Export Plug-In . SVG Version: 6.00 Build 0)  -->
<svg  xmlns="http://www.w3.org/2000/svg" xmlns:xlink="http://www.w3.org/1999/xlink" x="0px" y="0px"
	 viewBox="0 0 54 54" style="enable-background:new 0 0 54 54;" xml:space="preserve">
<path style="fill:#ED1C24 ;" d="M8.589,0C5.779,0,3.5,2.279,3.5,5.089V54l18-12l18,12V6c0-3.3,2.7-6,6-6H8.589z"/>
<path style="fill:#ED1C24 ;" d="M45.41,0.005C42.151,0.054,39.5,2.73,39.5,6v17h11V5.135C50.5,2.315,48.225,0.03,45.41,0.005z"/>
 
</svg>
