{
  "project_info": {
    "project_number": "415542061104",
    "firebase_url": "https://yashraj-kozo.firebaseio.com",
    "project_id": "yashraj-kozo",
    "storage_bucket": "yashraj-kozo.appspot.com"
  },
  "client": [
    {
      "client_info": {
        "mobilesdk_app_id": "1:415542061104:android:b50f337f17e8f0ed0065f5",
        "android_client_info": {
          "package_name": "io.binarynumbers.yashrajkozo"
        }
      },
      "oauth_client": [
        {
          "client_id": "415542061104-ec4jrpf647cut1sog8i0ml6m1oln9162.apps.googleusercontent.com",
          "client_type": 3
        }
      ],
      "api_key": [
        {
          "current_key": "AIzaSyAnV-C2twiCMdRvMp8V3mKxnA-ka9a2RiM"
        }
      ],
      "services": {
        "appinvite_service": {
          "other_platform_oauth_client": [
            {
              "client_id": "415542061104-ec4jrpf647cut1sog8i0ml6m1oln9162.apps.googleusercontent.com",
              "client_type": 3
            }
          ]
        }
      }
    }
  ],
  "configuration_version": "1"
}