{
	"info": {
		"_postman_id": "6cfebf46-301e-4147-ba9e-5cc0c5e3587d",
		"name": "TestCIRacoon",
		"schema": "https://schema.getpostman.com/json/collection/v2.1.0/collection.json"
	},
	"item": [
		{
			"name": "GetMockAPILoginDetails",
			"request": {
				"method": "GET",
				"header": [],
				"url": {
					"raw": "https://run.mocky.io/v3/726468a5-f71d-4b3c-84b5-2758710bea56",
					"protocol": "https",
					"host": [
						"run",
						"mocky",
						"io"
					],
					"path": [
						"v3",
						"726468a5-f71d-4b3c-84b5-2758710bea56"
					]
				}
			},
			"response": []
		},
		{
			"name": "DeleteGetMockAPILoginDetails",
			"event": [
				{
					"listen": "prerequest",
					"script": {
						"id": "5c8ce15f-0d49-4d16-b698-fa390fdb3d6b",
						"exec": [
							"\r",
							""
						],
						"type": "text/javascript"
					}
				},
				{
					"listen": "test",
					"script": {
						"id": "b12228f6-a251-4f60-aa08-32fba6529533",
						"exec": [
							"pm.test(\"response is ok\", function () {\r",
							"    pm.response.to.have.status(400);\r",
							"});"
						],
						"type": "text/javascript"
					}
				}
			],
			"request": {
				"method": "GET",
				"header": [],
				"url": {
					"raw": "https://designer.mocky.io/manage/delete/726468a5-f71d-4b3c-84b5-2758710bea56/mysecrettoken",
					"protocol": "https",
					"host": [
						"designer",
						"mocky",
						"io"
					],
					"path": [
						"manage",
						"delete",
						"726468a5-f71d-4b3c-84b5-2758710bea56",
						"mysecrettoken"
					]
				}
			},
			"response": []
		},
		{
			"name": "CreateMockApiTest",
			"request": {
				"method": "GET",
				"header": [],
				"url": {
					"raw": "https://run.mocky.io/v3/1aeb70d3-31e1-4dbb-921d-707560a509fa",
					"protocol": "https",
					"host": [
						"run",
						"mocky",
						"io"
					],
					"path": [
						"v3",
						"1aeb70d3-31e1-4dbb-921d-707560a509fa"
					]
				}
			},
			"response": []
		}
	],
	"protocolProfileBehavior": {}
}