{
	"info": {
		"_postman_id": "0c8c074c-6eb5-463a-953d-e7c041d10ed1",
		"name": "SampleTestCollectionServiceAvailabilityCheck-GetAccessToken-ThenRestAPICall",
		"schema": "https://schema.getpostman.com/json/collection/v2.1.0/collection.json"
	},
	"item": [
		{
			"name": "HealthCheckStatus",
			"event": [
				{
					"listen": "test",
					"script": {
						"id": "aec4db0c-d991-4d9d-9f02-08cc79c6c03b",
						"exec": [
							"pm.test(\"Status code is 200\", function () {\r",
							"    pm.response.to.have.status(200);\r",
							"    pm.globals.set(\"numberOfApiCall\", 1);\r",
							"    console.log(\"Inside 200 check\");\r",
							"    console.log(pm.globals.get(\"numberOfApiCall\"));\r",
							"    pm.globals.unset(\"timer\");\r",
							"    pm.globals.unset(\"numberOfApiCall\");\r",
							"    postman.setNextRequest(\"GetAccessToken\");\r",
							"});\r",
							"\r",
							"console.log(pm.response.status);\r",
							"\r",
							"if(pm.response.status !== \"OK\") {\r",
							"    console.log(\"Inside 400 check\");\r",
							"    if(!pm.globals.get(\"numberOfApiCall\")) {\r",
							"        pm.globals.set(\"numberOfApiCall\", 1);\r",
							"        console.log(pm.globals.get(\"numberOfApiCall\"));\r",
							"    }\r",
							"\r",
							"    if(pm.globals.get(\"numberOfApiCall\") == 1) {\r",
							"        console.log(\"numberOfApiCall = 1\");\r",
							"        var dt = new Date();\r",
							"        //var newdt = dt.setMinutes(dt.getMinutes() + 30);\r",
							"        var newdt = dt.setSeconds(dt.getSeconds() + 30);  // Currently checking for 30 seconds, uncomment the above line and comment this one to trigger HealthCheck api for 30 mins\r",
							"        pm.globals.set(\"timer\", newdt);    \r",
							"        console.log(\"Date:\", dt);   \r",
							"        postman.setNextRequest(\"HealthCheckStatus\");\r",
							"        pm.globals.set(\"numberOfApiCall\", pm.globals.get(\"numberOfApiCall\") + 1);\r",
							"        console.log(pm.globals.get(\"numberOfApiCall\"));\r",
							"    }\r",
							"    else if((pm.globals.get(\"numberOfApiCall\") > 1)) {\r",
							"         console.log(\"numberOfApiCall > 1\");\r",
							"         pm.globals.set(\"numberOfApiCall\", pm.globals.get(\"numberOfApiCall\") + 1);\r",
							"         var newdt = new Date();\r",
							"         //var newdt1 = newdt.toISOString()\r",
							"         //console.log(\"ISO Date:\", newdt1);\r",
							"         //console.log(\"New Date:\", newdt);\r",
							"         var newdt2 = newdt.setSeconds(newdt.getSeconds() + 0);\r",
							"         console.log(\"Updated New Date:\", newdt2);\r",
							"         console.log(\"Previous Date:\", pm.globals.get(\"timer\"))\r",
							"\r",
							"         if( newdt2 > pm.globals.get(\"timer\")) {\r",
							"            console.log( \"Health Check - Failed, service Not available\");\r",
							"            pm.globals.unset(\"timer\");\r",
							"            pm.globals.unset(\"numberOfApiCall\");\r",
							"            postman.setNextRequest(null);\r",
							"         }\r",
							"         else\r",
							"            postman.setNextRequest(\"HealthCheckStatus\");\r",
							"    }      \r",
							"}\r",
							"\r",
							"/**if(pm.response.status != 200)\r",
							"{\r",
							"    const requestdetails={\r",
							"        url: 'https://run.mocky.io/v3/726468a5-f71d-4b3c-84b5-2758710bea56',\r",
							"        method: \"get\",\r",
							"        header: {\r",
							"            'Content-Type': 'application/json'\r",
							"        }\r",
							"    };\r",
							"    var dt = new Date();\r",
							"    dt.setMinutes(dt.getMinutes() + 30);\r",
							"    var timeout = true;\r",
							"    while(timeout)\r",
							"    {\r",
							"        //postman.setNextRequest(\"HealthCheckStatus\");\r",
							"        pm.sendRequest(requestdetails);\r",
							"        var currentdt = new Date();\r",
							"        currentdt\r",
							"        \r",
							"    }\r",
							"} **/"
						],
						"type": "text/javascript"
					}
				}
			],
			"request": {
				"method": "GET",
				"header": [],
				"url": {
					"raw": "https://run.mocky.io/v3/726468a5-f71d-4b3c-84b5-2758710bea56",
					"protocol": "https",
					"host": [
						"run",
						"mocky",
						"io"
					],
					"path": [
						"v3",
						"726468a5-f71d-4b3c-84b5-2758710bea56"
					]
				}
			},
			"response": []
		},
		{
			"name": "GetAccessToken",
			"event": [
				{
					"listen": "test",
					"script": {
						"id": "22de0787-33b4-4c76-9daf-759267c4edcf",
						"exec": [
							"pm.test(\"Status code is 200\", function () {\r",
							"    pm.response.to.have.status(200);\r",
							"});\r",
							"\r",
							"pm.environment.set(\"access_token\", pm.response.json().access_token);\r",
							"\r",
							"if(!pm.environment.get(\"access_token\"))\r",
							"    postman.setNextRequest(null);"
						],
						"type": "text/javascript"
					}
				},
				{
					"listen": "prerequest",
					"script": {
						"id": "fdbedb34-d91d-40f4-8bc6-3c822e087f0c",
						"exec": [
							"if(pm.environment.get(\"access_token\"))\r",
							"    pm.environment.unset(\"access_token\");"
						],
						"type": "text/javascript"
					}
				}
			],
			"request": {
				"method": "GET",
				"header": [
					{
						"key": "Authorization",
						"value": "Basic ABCD12345678jkjfkhjhjbjk=",
						"type": "text"
					}
				],
				"url": {
					"raw": "https://run.mocky.io/v3/0a47cfd5-611a-4d06-ace9-27fbcc812f24",
					"protocol": "https",
					"host": [
						"run",
						"mocky",
						"io"
					],
					"path": [
						"v3",
						"0a47cfd5-611a-4d06-ace9-27fbcc812f24"
					]
				}
			},
			"response": []
		},
		{
			"name": "GetPatientDetails",
			"event": [
				{
					"listen": "test",
					"script": {
						"id": "3e6d0bf3-1605-4a24-b252-d9646a8f1e2b",
						"exec": [
							"/** https://learning.postman.com/docs/writing-scripts/script-references/test-examples/  ***/\r",
							"\r",
							"pm.test(\"Status code is 200\", function () {\r",
							"    pm.response.to.have.status(200);\r",
							"});\r",
							"\r",
							"pm.test(\"Body matches string\", function () {\r",
							"    //pm.expect(pm.response.text()).to.include(\"string_you_want_to_search\");\r",
							"    pm.expect(pm.response.text()).to.include(\"Levin\");\r",
							"});\r",
							"\r",
							"const response_body_string = '{\\n\\t\"resourceType\": \"Patient\",\\n\\t\"id\": \"314\",\\n\\t\"meta\": {\\n\\t\\t\"versionId\": \"1.0\"\\n\\t},\\n\\t\"identifier\": [{\\n\\t\\t\\t\"use\": \"usual\",\\n\\t\\t\\t\"label\": \"MRN\",\\n\\t\\t\\t\"system\": \"http://www.goodhealth.org/identifiers/mrn\",\\n\\t\\t\\t\"value\": \"123456\"\\n\\t\\t}\\n\\t],\\n\\t\"name\": [{\\n\\t\\t\\t\"family\": [\"Levin\"],\\n\\t\\t\\t\"given\": [\"Henry\"],\\n\\t\\t\\t\"suffix\": [\"\"]\\n\\t\\t}\\n\\t],\\n\\t\"gender\": {\\n\\t\\t\"text\": \"Male\"\\n\\t},\\n\\t\"birthDate\": \"1932-09-24\",\\n\\t\"active\": \\'true\\'\\n}';\r",
							"\r",
							"\r",
							"pm.test(\"Body is correct\", function () {\r",
							"    console.log(pm.response.text());\r",
							"    pm.response.to.have.body(response_body_string);\r",
							"});\r",
							"\r",
							"\r",
							"/** \r",
							"var schema = {\r",
							"  \"items\": {\r",
							"    \"type\": \"boolean\"\r",
							"  }\r",
							"};\r",
							"\r",
							"var data1 = [true, false];\r",
							"var data2 = [true, 123];\r",
							"\r",
							"pm.test('Schema is valid', function() {\r",
							"  pm.expect(tv4.validate(data1, schema)).to.be.true;\r",
							"  pm.expect(tv4.validate(data2, schema)).to.be.true;\r",
							"});\r",
							"pm.test(\"Your test name\", function () {\r",
							"    var jsonData = pm.response.json();\r",
							"    //pm.expect(jsonData.value).to.eql(100);\r",
							"    pm.expect(jsonData.value).to.eql(true);\r",
							"});\r",
							"**/\r",
							""
						],
						"type": "text/javascript"
					}
				}
			],
			"request": {
				"method": "GET",
				"header": [
					{
						"key": "Authorization",
						"value": "Basic {{access_token}}",
						"type": "text"
					}
				],
				"url": {
					"raw": "https://run.mocky.io/v3/2f365dd1-cbf7-45c0-9878-825df7cd4955",
					"protocol": "https",
					"host": [
						"run",
						"mocky",
						"io"
					],
					"path": [
						"v3",
						"2f365dd1-cbf7-45c0-9878-825df7cd4955"
					]
				}
			},
			"response": []
		}
	],
	"protocolProfileBehavior": {}
}