2019-06-05 11:06:34,752 INFO: Microblog startup [in /home/alfa/flask/test4/app/__init__.py:89]
2019-06-05 11:07:11,440 ERROR: Exception on /auth/login [POST] [in /home/alfa/flask/flask/lib/python3.6/site-packages/flask/app.py:1761]
Traceback (most recent call last):
  File "/home/alfa/flask/flask/lib/python3.6/site-packages/sqlalchemy/engine/base.py", line 1182, in _execute_context
    context)
  File "/home/alfa/flask/flask/lib/python3.6/site-packages/sqlalchemy/engine/default.py", line 470, in do_execute
    cursor.execute(statement, parameters)
sqlite3.OperationalError: no such table: user

The above exception was the direct cause of the following exception:

Traceback (most recent call last):
  File "/home/alfa/flask/flask/lib/python3.6/site-packages/flask/app.py", line 2292, in wsgi_app
    response = self.full_dispatch_request()
  File "/home/alfa/flask/flask/lib/python3.6/site-packages/flask/app.py", line 1815, in full_dispatch_request
    rv = self.handle_user_exception(e)
  File "/home/alfa/flask/flask/lib/python3.6/site-packages/flask/app.py", line 1718, in handle_user_exception
    reraise(exc_type, exc_value, tb)
  File "/home/alfa/flask/flask/lib/python3.6/site-packages/flask/_compat.py", line 35, in reraise
    raise value
  File "/home/alfa/flask/flask/lib/python3.6/site-packages/flask/app.py", line 1813, in full_dispatch_request
    rv = self.dispatch_request()
  File "/home/alfa/flask/flask/lib/python3.6/site-packages/flask/app.py", line 1799, in dispatch_request
    return self.view_functions[rule.endpoint](**req.view_args)
  File "/home/alfa/flask/test4/app/auth/routes.py", line 19, in login
    user = User.query.filter_by(username=form.username.data).first()
  File "/home/alfa/flask/flask/lib/python3.6/site-packages/sqlalchemy/orm/query.py", line 2755, in first
    ret = list(self[0:1])
  File "/home/alfa/flask/flask/lib/python3.6/site-packages/sqlalchemy/orm/query.py", line 2547, in __getitem__
    return list(res)
  File "/home/alfa/flask/flask/lib/python3.6/site-packages/sqlalchemy/orm/query.py", line 2855, in __iter__
    return self._execute_and_instances(context)
  File "/home/alfa/flask/flask/lib/python3.6/site-packages/sqlalchemy/orm/query.py", line 2878, in _execute_and_instances
    result = conn.execute(querycontext.statement, self._params)
  File "/home/alfa/flask/flask/lib/python3.6/site-packages/sqlalchemy/engine/base.py", line 945, in execute
    return meth(self, multiparams, params)
  File "/home/alfa/flask/flask/lib/python3.6/site-packages/sqlalchemy/sql/elements.py", line 263, in _execute_on_connection
    return connection._execute_clauseelement(self, multiparams, params)
  File "/home/alfa/flask/flask/lib/python3.6/site-packages/sqlalchemy/engine/base.py", line 1053, in _execute_clauseelement
    compiled_sql, distilled_params
  File "/home/alfa/flask/flask/lib/python3.6/site-packages/sqlalchemy/engine/base.py", line 1189, in _execute_context
    context)
  File "/home/alfa/flask/flask/lib/python3.6/site-packages/sqlalchemy/engine/base.py", line 1402, in _handle_dbapi_exception
    exc_info
  File "/home/alfa/flask/flask/lib/python3.6/site-packages/sqlalchemy/util/compat.py", line 203, in raise_from_cause
    reraise(type(exception), exception, tb=exc_tb, cause=cause)
  File "/home/alfa/flask/flask/lib/python3.6/site-packages/sqlalchemy/util/compat.py", line 186, in reraise
    raise value.with_traceback(tb)
  File "/home/alfa/flask/flask/lib/python3.6/site-packages/sqlalchemy/engine/base.py", line 1182, in _execute_context
    context)
  File "/home/alfa/flask/flask/lib/python3.6/site-packages/sqlalchemy/engine/default.py", line 470, in do_execute
    cursor.execute(statement, parameters)
sqlalchemy.exc.OperationalError: (sqlite3.OperationalError) no such table: user [SQL: 'SELECT user.id AS user_id, user.username AS user_username, user.email AS user_email, user.password_hash AS user_password_hash, user.about_me AS user_about_me, user.last_seen AS user_last_seen, user.token AS user_token, user.token_expiration AS user_token_expiration, user.last_message_read_time AS user_last_message_read_time \nFROM user \nWHERE user.username = ?\n LIMIT ? OFFSET ?'] [parameters: ('alfa', 1, 0)]
2019-06-05 11:07:28,206 INFO: Microblog startup [in /home/alfa/flask/test4/app/__init__.py:89]
2019-06-05 11:10:25,165 INFO: Microblog startup [in /home/alfa/flask/test4/app/__init__.py:89]
2019-06-05 11:10:58,587 INFO: Microblog startup [in /home/alfa/flask/test4/app/__init__.py:89]
2019-06-05 11:11:11,696 INFO: Microblog startup [in /home/alfa/flask/test4/app/__init__.py:89]
2019-06-05 11:11:33,002 INFO: Microblog startup [in /home/alfa/flask/test4/app/__init__.py:89]
2019-06-05 11:11:37,402 INFO: Microblog startup [in /home/alfa/flask/test4/app/__init__.py:89]
2019-06-05 11:11:43,326 INFO: Microblog startup [in /home/alfa/flask/test4/app/__init__.py:89]
2019-06-05 11:12:03,263 INFO: Microblog startup [in /home/alfa/flask/test4/app/__init__.py:89]
2019-06-05 11:12:07,560 INFO: Microblog startup [in /home/alfa/flask/test4/app/__init__.py:89]
2019-06-05 11:12:25,111 INFO: Microblog startup [in /home/alfa/flask/test4/app/__init__.py:89]
2019-06-05 11:15:33,873 INFO: Microblog startup [in /home/alfa/flask/test4/app/__init__.py:89]
