/home/osafi/workspace/spring-boot-keycloak-server/src/main/java/ms/safi/keycloak/EmbeddedKeycloakConfig.java
/home/osafi/workspace/spring-boot-keycloak-server/src/main/java/ms/safi/keycloak/EmbeddedKeycloakApplication.java
/home/osafi/workspace/spring-boot-keycloak-server/src/main/java/ms/safi/keycloak/KeycloakServerProperties.java
/home/osafi/workspace/spring-boot-keycloak-server/src/main/java/ms/safi/keycloak/EmbeddedKeycloakApp.java
