<?xml version="1.0" encoding="UTF-8"?>
<svg width="14px" height="10px" viewBox="0 0 14 10" version="1.1" xmlns="http://www.w3.org/2000/svg" xmlns:xlink="http://www.w3.org/1999/xlink">
    <!-- Generator: Sketch 50 (54983) - http://www.bohemiancoding.com/sketch -->
    <title>Group 10</title>
    <desc>Created with Sketch.</desc>
    <defs>
        <polygon id="path-1" points="5.56234655 10 0.1210535 10 0.1210535 0.00826022848 5.56234655 0.00826022848"></polygon>
    </defs>
    <g id="Page-1" stroke="none" stroke-width="1" fill="none" fill-rule="evenodd">
        <g id="Offer-Search-Page" transform="translate(-833.000000, -331.000000)">
            <g id="Group-3-Copy" transform="translate(721.000000, 311.000000)">
                <g id="Page-1-Copy-4" transform="translate(112.000000, 20.000000)">
                    <g id="Group-10">
                        <g id="Group-4" transform="translate(8.103030, 0.000000)">
                            <mask id="mask-2" fill="white">
                                <use xlink:href="#path-1"></use>
                            </mask>
                            <g id="Clip-3"></g>
                            <path d="M0.39926303,1.04397576 C1.7899297,2.48785455 3.17966303,3.93270303 4.5703297,5.37755152 L4.5703297,4.52033939 C3.14419636,6.00106667 1.71806303,7.48276364 0.29286303,8.96446061 C-0.23913697,9.51718788 0.585929697,10.3744 1.1179297,9.82167273 C2.5431297,8.33997576 3.96926303,6.85924848 5.39539636,5.37755152 C5.6175297,5.14579394 5.61846303,4.75209697 5.39539636,4.52033939 C4.0047297,3.07549091 2.61499636,1.63064242 1.2243297,0.186763636 C0.692329697,-0.365963636 -0.13273697,0.491248485 0.39926303,1.04397576" id="Fill-2" fill="#BD1622" mask="url(#mask-2)"></path>
                        </g>
                        <path d="M0.563453333,4.95350303 L13.0859867,4.95350303" id="Fill-5" fill="#FEFEFE"></path>
                        <g id="Group-9" transform="translate(0.000000, 4.181818)" fill="#BD1622">
                            <path d="M0.563453333,1.37774545 L13.0859867,1.37774545 C13.8363867,1.37774545 13.83732,0.165624242 13.0859867,0.165624242 L0.563453333,0.165624242 C-0.186946667,0.165624242 -0.188813333,1.37774545 0.563453333,1.37774545" id="Fill-7"></path>
                        </g>
                    </g>
                </g>
            </g>
        </g>
    </g>
</svg>