<svg width="31" height="30" viewBox="0 0 31 30" fill="none" xmlns="http://www.w3.org/2000/svg">
<g filter="url(#filter0_d_109_69)">
<path d="M7.6217 7.86499V18.9734C7.6217 20.0779 8.51713 20.9734 9.6217 20.9734H12.7714V13.4725H15.4867H18.202V20.9734H21.3517C22.4563 20.9734 23.3517 20.0779 23.3517 18.9734V7.86499" stroke="white" stroke-opacity="0.5" stroke-linecap="round" stroke-linejoin="round"/>
<path d="M5 10.4867L14.0725 1.41422C14.8535 0.633166 16.1199 0.633165 16.9009 1.41421L25.9734 10.4867" stroke="white" stroke-opacity="0.5" stroke-linecap="round" stroke-linejoin="round"/>
</g>
<defs>
<filter id="filter0_d_109_69" x="0.5" y="0.328369" width="29.9734" height="29.145" filterUnits="userSpaceOnUse" color-interpolation-filters="sRGB">
<feFlood flood-opacity="0" result="BackgroundImageFix"/>
<feColorMatrix in="SourceAlpha" type="matrix" values="0 0 0 0 0 0 0 0 0 0 0 0 0 0 0 0 0 0 127 0" result="hardAlpha"/>
<feOffset dy="4"/>
<feGaussianBlur stdDeviation="2"/>
<feComposite in2="hardAlpha" operator="out"/>
<feColorMatrix type="matrix" values="0 0 0 0 0 0 0 0 0 0 0 0 0 0 0 0 0 0 0.25 0"/>
<feBlend mode="normal" in2="BackgroundImageFix" result="effect1_dropShadow_109_69"/>
<feBlend mode="normal" in="SourceGraphic" in2="effect1_dropShadow_109_69" result="shape"/>
</filter>
</defs>
</svg>
