<svg width="30" height="30" viewBox="0 0 18 22" fill="none" xmlns="http://www.w3.org/2000/svg">
<path d="M1 18.9734V15.1084C1 14.0038 1.89543 13.1084 3 13.1084H14.73C15.8346 13.1084 16.73 14.0038 16.73 15.1084V18.9734C16.73 20.078 15.8346 20.9734 14.73 20.9734H3C1.89543 20.9734 1 20.078 1 18.9734Z" stroke="white" stroke-opacity="0.5"/>
<circle cx="8.86505" cy="5.24335" r="4.74335" stroke="white" stroke-opacity="0.5"/>
</svg>
