{
    "openapi": "3.0.0",
    "info": {
        "title": "PIR API documentation ",
        "description": "API doc",
        "termsOfService": "http://swagger.io/terms/",
        "contact": {
            "email": "safari.erie@gmail.com"
        },
        "license": {
            "name": "Apache 2.0",
            "url": "http://www.apache.org/licenses/LICENSE-2.0.html"
        },
        "version": "1.0.0"
    },
    "paths": {
        "/api/umkm/kbli/kategoris": {
            "get": {
                "tags": [
                    "KBLI_KategoriAll"
                ],
                "summary": "Return All Category Data",
                "description": "Retrive data category all",
                "operationId": "greet",
                "responses": {
                    "default": {
                        "description": "successful operation"
                    }
                }
            }
        },
        "/api/umkm/kbli/kategoriById": {
            "get": {
                "tags": [
                    "KBLI_kategoriId"
                ],
                "summary": "Return Spesific data",
                "description": "Retrive data category by kategori_id",
                "operationId": "categori",
                "parameters": [
                    {
                        "name": "id",
                        "in": "query",
                        "description": "id",
                        "required": true,
                        "schema": {
                            "type": "string"
                        }
                    }
                ],
                "responses": {
                    "default": {
                        "description": "successful operation"
                    }
                }
            }
        },
        "/api/umkm/kbli/kategoriCreate": {
            "post": {
                "tags": [
                    "KBLI_KategoriCreate"
                ],
                "summary": "Save Category",
                "description": "Save Category into database",
                "operationId": "category Save",
                "parameters": [
                    {
                        "name": "kd_kategori",
                        "in": "query",
                        "description": "kode kategori",
                        "required": true,
                        "schema": {
                            "type": "string"
                        }
                    },
                    {
                        "name": "kategori_nm",
                        "in": "query",
                        "description": "Nama kategori",
                        "required": true,
                        "schema": {
                            "type": "string"
                        }
                    },
                    {
                        "name": "kategori_desc",
                        "in": "query",
                        "description": "Deskripsi kategori",
                        "required": true,
                        "schema": {
                            "type": "string"
                        }
                    }
                ],
                "responses": {
                    "default": {
                        "description": "successful operation"
                    }
                }
            }
        },
        "/api/umkm/kbli/golongans": {
            "get": {
                "tags": [
                    "KBLI_GolonganAll"
                ],
                "summary": "Return All Data Golongan",
                "description": "Retrive data golongan",
                "operationId": "greet",
                "responses": {
                    "default": {
                        "description": "successful operation"
                    }
                }
            }
        },
        "/api/umkm/kbli/GolonganById": {
            "get": {
                "tags": [
                    "KBLI_GolonganById"
                ],
                "summary": "Return Spesific data golongan",
                "description": "Retrive data golongan by id_golongan",
                "operationId": "golongan",
                "parameters": [
                    {
                        "name": "id",
                        "in": "query",
                        "description": "id",
                        "required": true,
                        "schema": {
                            "type": "string"
                        }
                    }
                ],
                "responses": {
                    "default": {
                        "description": "successful operation"
                    }
                }
            }
        },
        "/api/umkm/kbli/GolonganCreate": {
            "post": {
                "tags": [
                    "KBLI_GolonganCreate"
                ],
                "summary": "Save Golongan",
                "description": "Save Golongan into database",
                "operationId": "Golongan Save",
                "parameters": [
                    {
                        "name": "kd_kategori",
                        "in": "query",
                        "description": "kode kategori",
                        "required": true,
                        "schema": {
                            "type": "string"
                        }
                    },
                    {
                        "name": "kategori_gol",
                        "in": "query",
                        "description": "Kode Golongan",
                        "required": true,
                        "schema": {
                            "type": "string"
                        }
                    },
                    {
                        "name": "kd_kbli",
                        "in": "query",
                        "description": "Kode KBLI",
                        "required": true,
                        "schema": {
                            "type": "string"
                        }
                    },
                    {
                        "name": "gol_nm",
                        "in": "query",
                        "description": "Nama Golongan",
                        "required": true,
                        "schema": {
                            "type": "string"
                        }
                    },
                    {
                        "name": "gol_des",
                        "in": "query",
                        "description": "Golongan Deskripsi",
                        "required": true,
                        "schema": {
                            "type": "string"
                        }
                    }
                ],
                "responses": {
                    "default": {
                        "description": "successful operation"
                    }
                }
            }
        }
    },
    "components": {
        "securitySchemes": {
            "api_key": {
                "type": "apiKey",
                "name": "Authorization",
                "in": "header"
            }
        }
    },
    "tags": [
        {
            "name": "PIR REST API",
            "description": "List API"
        }
    ]
}