[
    {
        "link": "/",
        "img": "/img/facebook.svg",
        "title": "Facebook"
    },
    {
        "link": "/",
        "img": "/img/whatsapp.svg",
        "title": "Whatsapp"
    },
    {
        "link": "/",
        "img": "/img/twitter.svg",
        "title": "Twitter"
    },
    {
        "link": "/",
        "img": "/img/linkedin.svg",
        "title": "Linkedin"
    }
]