{
  "name": "",
  "type": "",
  "host": "",
  "port": 0,
  "username": "",
  "password": "",
  "database": "",
  "entities": ["dist/src/db/entities/*.js"],
  "synchronize": true,
  "autoLoadEntities": true
}
