<svg xmlns="http://www.w3.org/2000/svg" xmlns:xlink="http://www.w3.org/1999/xlink" viewBox="0 0 32 32" height="32" width="32">
	<circle cx="16" cy="16" r="15" stroke="#4285F4" fill="#4285F4"/>
    <text x="10" y="23" stroke="white" fill="white" font-size="1.5em">1</text>
</svg>