<svg id="i-tag" xmlns="http://www.w3.org/2000/svg" viewBox="0 0 32 32" width="32" height="32" fill="none" stroke="#C5C5C5" stroke-linecap="round" stroke-linejoin="round" stroke-width="2">
    <circle cx="24" cy="8" r="2" />
    <path d="M2 18 L18 2 30 2 30 14 14 30 Z" />
</svg>