<svg id="i-info" xmlns="http://www.w3.org/2000/svg" viewBox="0 0 16 16" width="16" height="16" fill="none" stroke="currentcolor" stroke-linecap="round" stroke-linejoin="round" stroke-width="1">
    <path d="M8 7 L8 11 M8 4 L8 5" stroke="#424242" />
    <circle cx="8" cy="8" r="7" stroke="#424242"/>
</svg>