${c1}
     _/|       |\_   
    /  |       |  \  
   |    \     /    | 
   |  \ /     \ /  | 
   | \  |     |  / | 
   | \ _\_/^\_/_ / | 
   |    --\//--    | 
    \_  \     /  _/  
      \__  |  __/    
         \ _ /       
        _/   \_      
       / _/|\_ \     
        /  |  \      
         / v \       
