[
    {
        "id": 1,
        "description": "Administration Role",
        "code": "ROLE_ADMIN"
    },
    {
        "id": 2,
        "description": "Guest Role",
        "code": "ROLE_GUEST"
    }
]