[
    {
        "name": "Content",
        "roles": [
            "ROLE_ADMIN",
            "ROLE_GUEST"
        ],
        "childs": [
            {
                "id": 1,
                "name": "Home",
                "icon": "aui-icon-home-large",
                "route": "/home",
                "roles": [
                    "ROLE_GUEST"
                ]
            },
            {
                "id": 2,
                "name": "Ships",
                "icon": "aui-icon-home-large",
                "route": "/starships",
                "roles": [
                    "ROLE_GUEST",
                    "ROLE_ADMIN"
                ]
            }      ,
            {
                "id": 3,
                "name": "Page Restricted to ROLE_ADMIN",
                "icon": "aui-icon-home-large",
                "route": "/administration",
                "roles": [
                    "ROLE_ADMIN"
                ]
            }        
        ]
    }
]