<?xml version="1.0" encoding="UTF-8" standalone="no"?>
<svg
   xmlns:dc="http://purl.org/dc/elements/1.1/"
   xmlns:cc="http://creativecommons.org/ns#"
   xmlns:rdf="http://www.w3.org/1999/02/22-rdf-syntax-ns#"
   xmlns:svg="http://www.w3.org/2000/svg"
   xmlns="http://www.w3.org/2000/svg"
   xmlns:sodipodi="http://sodipodi.sourceforge.net/DTD/sodipodi-0.dtd"
   xmlns:inkscape="http://www.inkscape.org/namespaces/inkscape"
   xml:space="preserve"
   width="297mm"
   height="210mm"
   version="1.1"
   style="shape-rendering:geometricPrecision; text-rendering:geometricPrecision; image-rendering:optimizeQuality; fill-rule:evenodd; clip-rule:evenodd"
   viewBox="0 0 29700 21000"
   id="svg25"
   sodipodi:docname="VemOs_logo_inverse_light.svg"
   inkscape:version="1.0.2-2 (e86c870879, 2021-01-15)"><metadata
   id="metadata29"><rdf:RDF><cc:Work
       rdf:about=""><dc:format>image/svg+xml</dc:format><dc:type
         rdf:resource="http://purl.org/dc/dcmitype/StillImage" /></cc:Work></rdf:RDF></metadata><sodipodi:namedview
   pagecolor="#ffffff"
   bordercolor="#666666"
   borderopacity="1"
   objecttolerance="10"
   gridtolerance="10"
   guidetolerance="10"
   inkscape:pageopacity="0"
   inkscape:pageshadow="2"
   inkscape:window-width="1920"
   inkscape:window-height="1001"
   id="namedview27"
   showgrid="false"
   inkscape:zoom="0.73944569"
   inkscape:cx="766.2831"
   inkscape:cy="306.33409"
   inkscape:window-x="-9"
   inkscape:window-y="-9"
   inkscape:window-maximized="1"
   inkscape:current-layer="Layer_x0020_1" />
 <defs
   id="defs4">
  <style
   type="text/css"
   id="style2">
   <![CDATA[
    .str0 {stroke:black;stroke-width:20;stroke-miterlimit:22.9256}
    .fil2 {fill:#1BD693}
    .fil0 {fill:#333333}
    .fil1 {fill:white}
   ]]>
  </style>
 </defs>
 <g
   id="Layer_x0020_1">
  <metadata
   id="CorelCorpID_0Corel-Layer" />
  
  <g
   id="_1863404234368">
   <path
   class="fil1"
   d="M11729.24 9261.36c49.03,28.77 90.13,127.15 121.85,180.65 210.59,355.2 646.15,877.9 937.63,1168.51 200.34,199.74 421.23,385.75 641.79,564.75 103.83,84.27 235.47,183.02 347.14,256.04 58.92,38.54 336.96,206.39 364.63,236.86 -337.62,95.61 -801.51,96.36 -1143.64,24.32 -661.01,-139.18 -1145.85,-610.35 -1286.56,-1275.34 -89.24,-421.74 -58.88,-738.36 17.16,-1155.79zm5290.85 370.03c396.6,-76.22 509,533.58 115.98,609.08 -408.01,78.38 -526.92,-530.1 -115.98,-609.08zm478.84 -69.36c229.1,-315.37 478.45,-771.04 610.33,-1132.51 71.86,63.68 245.28,622.8 274.63,742.43 199.98,815.21 206.05,1757.02 -431.98,2392.03 -636.57,633.56 -1566.01,635.56 -2380.22,432.18 -125.9,-31.45 -676.38,-200.85 -750.53,-273.25 670.24,-245.87 1477.71,-794.72 1953.51,-1303.78 72.34,12.92 426.85,225.13 725.82,-121.55 84.18,-97.61 132.35,-233.98 133.13,-365.36 0.83,-142.55 -67.87,-255.99 -134.69,-370.19zm-5336.8 -2049.52c164.43,-33.02 326.73,80.46 358.74,242.13 32.99,166.63 -75.75,337.23 -240.86,366.5 -410.76,72.82 -519.23,-528.03 -117.88,-608.63zm5133.19 1903.14c-58.87,-5.69 -107.07,-33.59 -179.54,-38.33 -200.89,-13.14 -339.12,63.98 -471.51,199.96 -67.07,68.88 -118.09,207.8 -128.27,305.61 -16.89,162.11 28.64,223.37 85.78,356.72 -81.22,123.36 -497.52,457.2 -633.11,556.85 -413.67,304.05 -861.03,567.91 -1347.5,737.04 -125.68,43.7 -100.04,54.9 -216.56,-9.43 -248.02,-136.91 -501.02,-297.92 -725.4,-470.73 -644.67,-496.49 -1289.54,-1170.93 -1699.15,-1878.26 -171.41,-296 -168.63,-238.63 -111.75,-397.14 208.42,-580.9 142.28,-384.8 392.07,-402.23 62.37,-4.35 129.16,-21.37 184.92,-47.58 113.26,-53.22 181.84,-116.92 248.31,-217.19 69.77,-105.27 95.03,-250.06 76.87,-375.2 -23.74,-163.58 -74.1,-196.53 -156.28,-315.88 71.37,-146.18 560.35,-652.07 698.2,-785.87 463.87,-450.23 1225.45,-953.93 1839.14,-1156.39 164.06,-54.13 109.47,-62.66 260.23,18.78 550.37,297.3 1038.63,706.79 1476.77,1147.76 337.18,339.36 734.07,852.88 975.04,1279.54 107.76,190.8 131.96,158.56 -28.19,526.89 -120.32,276.71 -347.55,740.02 -540.07,965.08zm-1647.83 -4076.54c281.06,-103.69 846.53,-87.49 1151.16,-24.79 918.46,189.02 1359.74,971.15 1332.96,1875.65 -2.87,97.01 -29.24,493.67 -85.24,552.87 -155.59,-240.51 -308.61,-500.59 -491.39,-717.58 -514.03,-610.24 -886.35,-998.88 -1551.35,-1454.18 -90.1,-61.69 -287.72,-170.51 -356.14,-231.97zm-3975.39 3235.42c-86.98,-127.95 -230.34,-594.17 -270.99,-757.83 -203.12,-817.82 -193.46,-1744.73 440.99,-2379.35 630,-630.17 1575.8,-630.3 2383.34,-426.66 119.68,30.19 680.91,201.29 742.02,274.42 -637.21,208.51 -1251.65,674.43 -1753.84,1101.43 -53.61,45.59 -91.64,97.47 -142.72,143.03l-284.8 286.92c-38.77,48.56 -91.59,104.99 -134.01,151.54 -50.89,55.83 -218.53,288.45 -251.07,311.8 -22.68,5.16 -155.5,-24.29 -215.17,-21.26 -68.92,3.49 -129.7,19.7 -191.55,45.21 -235.27,97.03 -371.08,351.01 -329.25,607.86 25.38,155.89 87.98,203.91 161.71,314.97l-154.66 347.92zm1487.03 -3930.99c-1132.72,70.56 -1952.57,759.29 -2100.84,1904.4 -96.7,746.85 87.4,1411.78 362.73,2085.95 48.8,119.49 141.43,235.44 120.31,362.54 -10.84,65.2 -38.59,130.87 -52.69,197.36 -14.61,68.92 -27.34,143.66 -38.77,213.33 -294.79,1797.64 934.73,2895.47 2754.6,2504.98 158.26,-33.96 225.42,-99.88 386.17,-15.35 577.01,303.4 1396.26,501.71 2044.72,465.03 1123.05,-63.51 1949.63,-771.37 2093.99,-1902.68 97.23,-762.01 -86.38,-1404.1 -362.21,-2087.22 -48.96,-121.24 -143,-233.36 -121.83,-363.1 13.74,-84.14 61.13,-223.58 90.53,-411.12 287.63,-1835.01 -950.33,-2885.83 -2752.5,-2503.75 -155.19,32.9 -229.75,100.65 -386.34,16.06 -558.01,-301.42 -1407.88,-505.67 -2037.87,-466.43z"
   id="path9" />
   <path
   class="fil2"
   d="M14090.12 14232.81c-20.77,-49.54 -4.77,-248.32 -8.79,-320.09l-612.28 -0.08 -1.05 2011.89 613.32 5.21c12.03,-315.23 1.04,-651.57 0.96,-967.42 -0.03,-163.28 4.79,-248.5 100.33,-383.98 130.15,-184.56 463.08,-253.27 647.38,-17.93 85.35,108.97 95.58,254.39 95.76,391.32 0.2,143.95 -9.79,900.7 5.3,975.33l608.82 2.95c-1.8,-321.02 -0.31,-644.55 -0.25,-967.69 0.03,-166.79 -1.69,-236.99 104.76,-370.87 176.35,-221.82 475.82,-249.45 646.13,-42.18 164.38,200.04 39.2,1080.93 86.67,1375.66 58.12,10.96 561.05,11.49 606.9,-2.41 13.53,-87.94 3.94,-847.26 3.94,-1002.55 0.01,-277.85 -24.98,-583.45 -220.82,-794.98 -334.73,-361.54 -927.86,-318.24 -1234.79,36.41 -38.96,45.02 -69.41,103.27 -106.99,140.23 -64.26,-69.12 -107.22,-169.96 -256.15,-271.46 -306.48,-208.86 -733,-212.18 -964.35,40.89 -30.91,33.82 -94.92,146.27 -114.8,161.75z"
   id="path11" />
   <path
   class="fil1"
   d="M14470.94 10122.87c112.83,-0.01 225.66,-0.09 338.5,-0.02 210.57,0.13 461.9,-12.48 667.49,2.79 37.02,34.16 65.02,70.1 13.76,108.83 -37.86,17.57 -1131.91,21.46 -1196.82,1.91 -91.69,-133.57 105.68,-113.5 177.07,-113.51zm-165.86 -358.75c44.42,-32.6 573.51,-16.51 673.61,-16.51 68.27,0 463.65,-14.77 509.41,14.11 41.99,26.5 36.83,83.08 -4.95,104.26 -34.8,17.64 -869.68,9.13 -1022.79,9.15 -37.93,0 -125.23,6.49 -155.4,-9.78 -47.06,-25.37 -41.31,-70.82 0.12,-101.23zm538.73 -1877.77c310.21,-71.84 424.16,409.38 108.11,484.04 -317.89,75.08 -437.23,-407.83 -108.11,-484.04zm-448.52 1389.2c-259.82,-140.93 -423.11,-264.62 -577.64,-520.98 -467.48,-775.55 77.35,-1865.65 1075.85,-1872.16 1004.44,-6.54 1545.11,1125.72 1074.54,1879.57 -60.82,97.42 -158.32,232.93 -249.58,301.52 -211.73,159.12 -143.64,98.34 -326.35,211.75l-3.46 223.97 -367.76 -3.55 2.54 -885.69c127.24,-60.9 184.19,-70.47 272.78,-191.72 73.55,-100.66 107.32,-231.45 90.29,-356.95 -77.53,-571.64 -908.29,-567.14 -985.34,-0.11 -18.7,137.56 19.93,253.73 95.04,363.51 77.26,112.92 154.06,128.88 271.36,185.73l-3.85 888.44 -366.08 -3.23 -2.34 -220.1zm-248.28 151.14c15.85,207.08 -43.63,124.33 -101.88,270.01 -46.46,116.19 -18.73,198.59 37.01,299.36 -40.64,108.52 -85.69,146.26 -43.71,284.84 24.72,81.62 93.63,153.87 170.67,189.03 109.25,49.85 539.16,29.76 684.96,29.75 141.19,-0.01 573.23,16.96 677.23,-26.2 80.62,-33.46 146.65,-104.07 175.08,-184.76 47.63,-135.16 3.07,-183.25 -40.47,-292.66 52.99,-99.17 83.75,-185.7 37.44,-299.18 -60.08,-147.21 -120.02,-66.26 -100.53,-276.28 593.34,-360.69 879.37,-1027.39 686.15,-1707.08 -180.69,-635.64 -776.81,-1077.98 -1434.87,-1079.11 -652.7,-1.12 -1260.41,445.75 -1433.83,1079.31 -161.44,589.78 25.09,1205.97 498.04,1577.9 60.46,47.55 134.3,88.69 188.71,135.07z"
   id="path13" />
   <path
   class="fil2"
   d="M11725.68 14700.8c26.55,-176.95 255.76,-300.69 428.66,-300.57 167.93,0.11 395.07,131.51 415.05,302.22l-843.71 -1.65zm1280.92 964.16l-252.72 -254.47c-139.59,-138.39 -90.09,-13.07 -346.79,26.93 -145.91,22.73 -315.38,27.5 -451.28,-32.88 -85.43,-37.96 -244.6,-167.02 -233.67,-269.56 210.93,-18.08 1312.97,23.3 1395.78,-11.28 28.63,-69.69 17.12,-358.14 0.77,-439.56 -215.74,-1074.17 -1575.13,-1004.81 -1939.42,-210.72 -110.74,241.38 -129.96,537.55 -44.53,789.62 171.36,505.58 725.3,769.57 1218.53,701.58 127.04,-17.51 258.76,-42.41 375.07,-99.44 72.04,-35.33 242.92,-135.43 278.26,-200.22z"
   id="path15" />
   <path
   class="fil2"
   d="M18329.75 14416.84c259.33,-41.06 501.08,209.24 509.4,460.33 9.12,275.47 -133.09,519.14 -422.76,549.41 -597.97,62.5 -750.47,-904.64 -86.64,-1009.74zm-71.58 -538.96c-598.28,96.53 -1001.78,522.95 -953.32,1147.97 45.91,592.23 596.44,1001.08 1174.55,941.35 582.55,-60.2 1025,-568.02 949.56,-1161.37 -35.79,-281.47 -152.57,-506.61 -371.35,-686.41 -203.08,-166.89 -537.5,-283.8 -799.44,-241.54z"
   id="path17" />
   <path
   class="fil2"
   d="M20141.3 15249.52l-476.95 155.11c16.81,114.5 135.19,286.18 225.09,359.89 263.97,216.4 599.78,263.78 931.09,163.54 570.66,-172.64 631.21,-806.76 267.86,-1045.96 -197.22,-129.83 -418.53,-175.38 -629.91,-259.16 -100.63,-39.89 -119.87,-76.92 -113.98,-180.45 55.48,-68.83 141.11,-107.47 229.86,-72.67 94.89,37.21 108.28,109.52 163.09,175.78 68.79,-17.63 472.11,-118.32 499.08,-138.68 6.73,-110.63 -184.7,-330.36 -276.45,-391.95 -476.47,-319.87 -1255.92,-101.35 -1214.06,513.3 25.64,376.47 417.88,524.48 723.07,635.04 79.06,28.63 162.58,53.45 217.83,120.79 58.54,71.34 -50.98,172.11 -115.58,193.58 -81.92,27.21 -200.31,10.07 -271.02,-39.36 -89.99,-62.91 -99.49,-101.71 -159.02,-188.8z"
   id="path19" />
   <path
   class="fil2"
   d="M8504.82 13904.63c-9.72,29.09 78.21,198.05 98.15,239.01 40.36,82.87 74.43,172.61 114.01,257l454.12 1017.38c77.14,170.16 153.58,342.58 228.85,509.88l543.63 1.21 791.05 -1773.77c27.96,-61.19 108.73,-206.42 102.05,-255.91l-586.09 -1.91c-74.72,53.78 -511.61,1237.38 -584.16,1285.34 -26.69,-60.96 -542.01,-1265.72 -570.37,-1282.79 -53.16,-9.95 -563.67,-9.16 -591.24,4.56z"
   id="path21" />
  </g>
 </g>
</svg>
