%YAML 1.1
%TAG !u! tag:unity3d.com,2011:
--- !u!1045 &1
EditorBuildSettings:
  m_ObjectHideFlags: 0
  serializedVersion: 2
  m_Scenes:
  - enabled: 1
    path: Assets/Scenes/SampleScene.unity
    guid: 9fc0d4010bbf28b4594072e72b8655ab
  m_configObjects:
    Unity.XR.Oculus.Settings: {fileID: 11400000, guid: c92c76f09f5d2403fb055976664cb423, type: 2}
    com.unity.xr.management.loader_settings: {fileID: 11400000, guid: b6fee4ab27f9f43d197a7764a99ccd3d, type: 2}
