%YAML 1.1
%TAG !u! tag:unity3d.com,2011:
--- !u!114 &11400000
MonoBehaviour:
  m_ObjectHideFlags: 0
  m_CorrespondingSourceObject: {fileID: 0}
  m_PrefabInstance: {fileID: 0}
  m_PrefabAsset: {fileID: 0}
  m_GameObject: {fileID: 0}
  m_Enabled: 1
  m_EditorHideFlags: 0
  m_Script: {fileID: 11500000, guid: 71c1514a6bd24e1e882cebbe1904ce04, type: 3}
  m_Name: BebasNeue-Regular SDF
  m_EditorClassIdentifier: 
  hashCode: 0
  material: {fileID: 0}
  materialHashCode: 0
  m_Version: 
  m_SourceFontFileGUID: 
  m_SourceFontFile_EditorRef: {fileID: 0}
  m_SourceFontFile: {fileID: 0}
  m_AtlasPopulationMode: 0
  m_FaceInfo:
    m_FaceIndex: 0
    m_FamilyName: 
    m_StyleName: 
    m_PointSize: 0
    m_Scale: 0
    m_LineHeight: 0
    m_AscentLine: 0
    m_CapLine: 0
    m_MeanLine: 0
    m_Baseline: 0
    m_DescentLine: 0
    m_SuperscriptOffset: 0
    m_SuperscriptSize: 0
    m_SubscriptOffset: 0
    m_SubscriptSize: 0
    m_UnderlineOffset: 0
    m_UnderlineThickness: 0
    m_StrikethroughOffset: 0
    m_StrikethroughThickness: 0
    m_TabWidth: 0
  m_GlyphTable: []
  m_CharacterTable: []
  m_AtlasTextures: []
  m_AtlasTextureIndex: 0
  m_IsMultiAtlasTexturesEnabled: 0
  m_ClearDynamicDataOnBuild: 0
  m_UsedGlyphRects: []
  m_FreeGlyphRects: []
  m_fontInfo:
    Name: 
    PointSize: 0
    Scale: 0
    CharacterCount: 0
    LineHeight: 0
    Baseline: 0
    Ascender: 0
    CapHeight: 0
    Descender: 0
    CenterLine: 0
    SuperscriptOffset: 0
    SubscriptOffset: 0
    SubSize: 0
    Underline: 0
    UnderlineThickness: 0
    strikethrough: 0
    strikethroughThickness: 0
    TabWidth: 0
    Padding: 0
    AtlasWidth: 0
    AtlasHeight: 0
  atlas: {fileID: 0}
  m_AtlasWidth: 0
  m_AtlasHeight: 0
  m_AtlasPadding: 0
  m_AtlasRenderMode: 0
  m_glyphInfoList: []
  m_KerningTable:
    kerningPairs: []
  m_FontFeatureTable:
    m_GlyphPairAdjustmentRecords: []
  fallbackFontAssets: []
  m_FallbackFontAssetTable: []
  m_CreationSettings:
    sourceFontFileName: 
    sourceFontFileGUID: 
    pointSizeSamplingMode: 0
    pointSize: 0
    padding: 0
    packingMode: 0
    atlasWidth: 0
    atlasHeight: 0
    characterSetSelectionMode: 0
    characterSequence: 
    referencedFontAssetGUID: 
    referencedTextAssetGUID: 
    fontStyle: 0
    fontStyleModifier: 0
    renderMode: 0
    includeFontFeatures: 0
  m_FontWeightTable:
  - regularTypeface: {fileID: 0}
    italicTypeface: {fileID: 0}
  - regularTypeface: {fileID: 0}
    italicTypeface: {fileID: 0}
  - regularTypeface: {fileID: 0}
    italicTypeface: {fileID: 0}
  - regularTypeface: {fileID: 0}
    italicTypeface: {fileID: 0}
  - regularTypeface: {fileID: 0}
    italicTypeface: {fileID: 0}
  - regularTypeface: {fileID: 0}
    italicTypeface: {fileID: 0}
  - regularTypeface: {fileID: 0}
    italicTypeface: {fileID: 0}
  - regularTypeface: {fileID: 0}
    italicTypeface: {fileID: 0}
  - regularTypeface: {fileID: 0}
    italicTypeface: {fileID: 0}
  - regularTypeface: {fileID: 0}
    italicTypeface: {fileID: 0}
  fontWeights: []
  normalStyle: 0
  normalSpacingOffset: 0
  boldStyle: 0.75
  boldSpacing: 7
  italicStyle: 35
  tabSize: 10
