<svg width="110" height="36" viewBox="0 0 110 36" fill="none" xmlns="http://www.w3.org/2000/svg">
<line x1="40" y1="13" x2="21" y2="13" stroke="#F9F6ED"/>
<line x1="36" y1="19" x2="21" y2="19" stroke="#F9F6ED"/>
<path d="M50.462 23.5V15.716L54.046 23.5H54.711L58.302 15.716V23.493H59.282V13.42H58.323L54.382 21.897L50.42 13.42H49.475V23.5H50.462ZM67.8265 23.5V22.513H62.5555V18.88H66.9865V17.893H62.5555V14.407H67.8265V13.42H61.5265V23.5H67.8265ZM70.8269 23.5V15.233L76.3779 23.5H77.4139V13.42H76.3779V21.68L70.8269 13.42H69.7909V23.5H70.8269ZM83.5889 23.71C85.8919 23.71 87.5229 22.177 87.5229 19.86V13.42H86.4869V19.727C86.4869 21.82 84.8979 22.737 83.5889 22.737C82.2939 22.737 80.6909 21.827 80.6909 19.727V13.42L79.6549 13.427V19.86C79.6549 22.191 81.2859 23.71 83.5889 23.71Z" fill="#F9F6ED"/>
<rect x="0.5" y="1" width="109" height="34" rx="17" stroke="#F9F6ED"/>
</svg>
