%YAML 1.1
%TAG !u! tag:unity3d.com,2011:
--- !u!114 &11400000
MonoBehaviour:
  m_ObjectHideFlags: 0
  m_CorrespondingSourceObject: {fileID: 0}
  m_PrefabInstance: {fileID: 0}
  m_PrefabAsset: {fileID: 0}
  m_GameObject: {fileID: 0}
  m_Enabled: 1
  m_EditorHideFlags: 0
  m_Script: {fileID: 11500000, guid: cf2248f03e405304cb43ea3192d04f50, type: 3}
  m_Name: Einstein
  m_EditorClassIdentifier: 
  EnemyId: Einstein
  EnemyItem: EMC2
  EnemySpritePath: Sprites/einstein
  EnemyVoiceline1: Sounds/Relatif
  EnemyVoiceline2: 
