/var/log/messages{
    missingok
    weekly
    rotate = 3
    maxsize 10M
    compress
    delaycompress
    notifempty
    su root root
    sharedscripts
    postrotate
        /etc/init.d/rsyslog restart
    endscript
}
