{
  "luis_schema_version": "2.0.0",
  "versionId": "0.1",
  "name": "Joanna",
  "desc": "2.0",
  "culture": "en-us",
  "intents": [
    {
      "name": "None"
    },
    {
      "name": "PeopleAndRoles.GetAllWithRole"
    },
    {
      "name": "PeopleAndRoles.GetPersonsWithRoleInRelationTo"
    },
    {
      "name": "PeopleAndRoles.WhatAreResponsibilitiesForRole"
    },
    {
      "name": "PeopleAndRoles.WhatAreResponsibilitiesOf"
    },
    {
      "name": "PeopleAndRoles.WhatIsRoleOf"
    },
    {
      "name": "PeopleAndRoles.WhoIsResponsibleFor"
    },
    {
      "name": "QueryProcess.DisplayProcess"
    },
    {
      "name": "QueryProcess.GetListOfProcesses"
    },
    {
      "name": "QueryProcess.WhoIsResponsibleForProcess"
    },
    {
      "name": "QueryUserContext.DiplayQueriesAboutEntity"
    },
    {
      "name": "QueryUserContext.DiplayQueriesAboutIntent"
    },
    {
      "name": "QueryUserContext.DisplayAllUnansweredQueries"
    },
    {
      "name": "QueryUserContext.DisplayQueriesFor"
    },
    {
      "name": "Smalltalks.Hello"
    },
    {
      "name": "Smalltalks.Help"
    }
  ],
  "entities": [
    {
      "name": "entity"
    },
    {
      "name": "intent"
    },
    {
      "name": "location"
    },
    {
      "name": "person"
    },
    {
      "name": "process"
    },
    {
      "name": "responsibility"
    },
    {
      "name": "role"
    }
  ],
  "composites": [],
  "closedLists": [],
  "bing_entities": [
    "datetime"
  ],
  "actions": [],
  "model_features": [
    {
      "name": "intent",
      "mode": true,
      "words": "room booking",
      "activated": true
    },
    {
      "name": "process",
      "mode": true,
      "words": "relocation,ordering equipment",
      "activated": true
    },
    {
      "name": "responsibility",
      "mode": true,
      "words": "events,relocation,taxes,onboarding",
      "activated": true
    },
    {
      "name": "role",
      "mode": true,
      "words": "designer,consultant,qa specialist,it support specialist,hr manager,team manager,administrative assistant,sales",
      "activated": true
    }
  ],
  "regex_features": [],
  "utterances": [
    {
      "text": "what is the main offices?",
      "intent": "None",
      "entities": []
    },
    {
      "text": "what is about events in infusion?",
      "intent": "None",
      "entities": [
        {
          "entity": "responsibility",
          "startPos": 14,
          "endPos": 19
        },
        {
          "entity": "location",
          "startPos": 24,
          "endPos": 31
        }
      ]
    },
    {
      "text": "what kinds of specialists are working in infusion?",
      "intent": "None",
      "entities": []
    },
    {
      "text": "what is linkedin of infusion?",
      "intent": "None",
      "entities": []
    },
    {
      "text": "what is the company size?",
      "intent": "None",
      "entities": []
    },
    {
      "text": "what is about education?",
      "intent": "None",
      "entities": []
    },
    {
      "text": "what is education industry?",
      "intent": "None",
      "entities": []
    },
    {
      "text": "what is about travel & leisure?",
      "intent": "None",
      "entities": []
    },
    {
      "text": "what is travel & leisure industry?",
      "intent": "None",
      "entities": []
    },
    {
      "text": "what is healthcare?",
      "intent": "None",
      "entities": []
    },
    {
      "text": "what is about healthcare?",
      "intent": "None",
      "entities": []
    },
    {
      "text": "what is about retail?",
      "intent": "None",
      "entities": []
    },
    {
      "text": "what is oil & gas industry?",
      "intent": "None",
      "entities": []
    },
    {
      "text": "what is retail industry?",
      "intent": "None",
      "entities": []
    },
    {
      "text": "what is about insurance?",
      "intent": "None",
      "entities": []
    },
    {
      "text": "what is about oil & gas?",
      "intent": "None",
      "entities": []
    },
    {
      "text": "what is insurance industry?",
      "intent": "None",
      "entities": []
    },
    {
      "text": "what infusion is doing for banking industry?",
      "intent": "None",
      "entities": []
    },
    {
      "text": "what infusion is doing for capital markets?",
      "intent": "None",
      "entities": []
    },
    {
      "text": "what is capital markets?",
      "intent": "None",
      "entities": []
    },
    {
      "text": "what is the main industry of infusion company?",
      "intent": "None",
      "entities": []
    },
    {
      "text": "what is infusion website?",
      "intent": "None",
      "entities": []
    },
    {
      "text": "where is headquarters of infusion?",
      "intent": "None",
      "entities": []
    },
    {
      "text": "how many people are working in capital market?",
      "intent": "None",
      "entities": []
    },
    {
      "text": "what is infusion company?",
      "intent": "None",
      "entities": []
    },
    {
      "text": "when infusion has been created?",
      "intent": "None",
      "entities": []
    },
    {
      "text": "i want to find a person who knows about taxes",
      "intent": "PeopleAndRoles.WhoIsResponsibleFor",
      "entities": [
        {
          "entity": "responsibility",
          "startPos": 40,
          "endPos": 44
        }
      ]
    },
    {
      "text": "who can i talk to about my taxes?",
      "intent": "PeopleAndRoles.WhoIsResponsibleFor",
      "entities": [
        {
          "entity": "responsibility",
          "startPos": 27,
          "endPos": 31
        }
      ]
    },
    {
      "text": "who is in charge of relocations in wrocław?",
      "intent": "PeopleAndRoles.WhoIsResponsibleFor",
      "entities": [
        {
          "entity": "responsibility",
          "startPos": 20,
          "endPos": 30
        },
        {
          "entity": "location",
          "startPos": 35,
          "endPos": 41
        }
      ]
    },
    {
      "text": "anyone knows something about taxes in toronto?",
      "intent": "PeopleAndRoles.WhoIsResponsibleFor",
      "entities": [
        {
          "entity": "responsibility",
          "startPos": 29,
          "endPos": 33
        },
        {
          "entity": "location",
          "startPos": 38,
          "endPos": 44
        }
      ]
    },
    {
      "text": "who is responsible for relocation",
      "intent": "PeopleAndRoles.WhoIsResponsibleFor",
      "entities": [
        {
          "entity": "responsibility",
          "startPos": 23,
          "endPos": 32
        }
      ]
    },
    {
      "text": "who handles monitoring?",
      "intent": "PeopleAndRoles.WhoIsResponsibleFor",
      "entities": [
        {
          "entity": "responsibility",
          "startPos": 12,
          "endPos": 21
        }
      ]
    },
    {
      "text": "is there anyone i can talk about network monitoring?",
      "intent": "PeopleAndRoles.WhoIsResponsibleFor",
      "entities": [
        {
          "entity": "responsibility",
          "startPos": 33,
          "endPos": 50
        }
      ]
    },
    {
      "text": "who is responsible for events in kraków?",
      "intent": "PeopleAndRoles.WhoIsResponsibleFor",
      "entities": [
        {
          "entity": "responsibility",
          "startPos": 23,
          "endPos": 28
        },
        {
          "entity": "location",
          "startPos": 33,
          "endPos": 38
        }
      ]
    },
    {
      "text": "what does john rambo do?",
      "intent": "PeopleAndRoles.WhatIsRoleOf",
      "entities": [
        {
          "entity": "person",
          "startPos": 10,
          "endPos": 19
        }
      ]
    },
    {
      "text": "what is john's position in toronto?",
      "intent": "PeopleAndRoles.WhatIsRoleOf",
      "entities": [
        {
          "entity": "person",
          "startPos": 8,
          "endPos": 11
        },
        {
          "entity": "location",
          "startPos": 27,
          "endPos": 33
        }
      ]
    },
    {
      "text": "what is roger's role within the organisation?",
      "intent": "PeopleAndRoles.WhatIsRoleOf",
      "entities": [
        {
          "entity": "person",
          "startPos": 8,
          "endPos": 12
        }
      ]
    },
    {
      "text": "who is my manager?",
      "intent": "PeopleAndRoles.GetPersonsWithRoleInRelationTo",
      "entities": [
        {
          "entity": "person",
          "startPos": 7,
          "endPos": 8
        },
        {
          "entity": "role",
          "startPos": 10,
          "endPos": 16
        }
      ]
    },
    {
      "text": "what's the name of tomek's team leader?",
      "intent": "PeopleAndRoles.GetPersonsWithRoleInRelationTo",
      "entities": [
        {
          "entity": "person",
          "startPos": 19,
          "endPos": 23
        },
        {
          "entity": "role",
          "startPos": 27,
          "endPos": 37
        }
      ]
    },
    {
      "text": "who is a consultant in wrocław?",
      "intent": "PeopleAndRoles.GetAllWithRole",
      "entities": [
        {
          "entity": "location",
          "startPos": 23,
          "endPos": 29
        },
        {
          "entity": "role",
          "startPos": 9,
          "endPos": 18
        }
      ]
    },
    {
      "text": "give me the list of team leaders in toronto?",
      "intent": "PeopleAndRoles.GetAllWithRole",
      "entities": [
        {
          "entity": "location",
          "startPos": 36,
          "endPos": 42
        },
        {
          "entity": "role",
          "startPos": 20,
          "endPos": 31
        }
      ]
    },
    {
      "text": "list all sales",
      "intent": "PeopleAndRoles.GetAllWithRole",
      "entities": [
        {
          "entity": "role",
          "startPos": 9,
          "endPos": 13
        }
      ]
    },
    {
      "text": "can you show me the list of all designers working for infusion?",
      "intent": "PeopleAndRoles.GetAllWithRole",
      "entities": [
        {
          "entity": "role",
          "startPos": 32,
          "endPos": 40
        }
      ]
    },
    {
      "text": "display consultants in wrocław",
      "intent": "PeopleAndRoles.GetAllWithRole",
      "entities": [
        {
          "entity": "location",
          "startPos": 23,
          "endPos": 29
        },
        {
          "entity": "role",
          "startPos": 8,
          "endPos": 18
        }
      ]
    },
    {
      "text": "show me all consultants in toronto",
      "intent": "PeopleAndRoles.GetAllWithRole",
      "entities": [
        {
          "entity": "location",
          "startPos": 27,
          "endPos": 33
        },
        {
          "entity": "role",
          "startPos": 12,
          "endPos": 22
        }
      ]
    },
    {
      "text": "list all responsibilities of a consultant.",
      "intent": "PeopleAndRoles.WhatAreResponsibilitiesForRole",
      "entities": [
        {
          "entity": "role",
          "startPos": 31,
          "endPos": 40
        }
      ]
    },
    {
      "text": "what does a manager do?",
      "intent": "PeopleAndRoles.WhatAreResponsibilitiesForRole",
      "entities": [
        {
          "entity": "role",
          "startPos": 12,
          "endPos": 18
        }
      ]
    },
    {
      "text": "what is sales responsible for?",
      "intent": "PeopleAndRoles.WhatAreResponsibilitiesForRole",
      "entities": [
        {
          "entity": "role",
          "startPos": 8,
          "endPos": 12
        }
      ]
    },
    {
      "text": "display all responsibilities of a team manager",
      "intent": "PeopleAndRoles.WhatAreResponsibilitiesForRole",
      "entities": [
        {
          "entity": "role",
          "startPos": 34,
          "endPos": 45
        }
      ]
    },
    {
      "text": "what does justyna do?",
      "intent": "PeopleAndRoles.WhatAreResponsibilitiesOf",
      "entities": [
        {
          "entity": "person",
          "startPos": 10,
          "endPos": 16
        }
      ]
    },
    {
      "text": "what are donald's duties?",
      "intent": "PeopleAndRoles.WhatAreResponsibilitiesOf",
      "entities": [
        {
          "entity": "person",
          "startPos": 9,
          "endPos": 14
        }
      ]
    },
    {
      "text": "what are my responsibilities?",
      "intent": "PeopleAndRoles.WhatAreResponsibilitiesOf",
      "entities": [
        {
          "entity": "person",
          "startPos": 9,
          "endPos": 10
        }
      ]
    },
    {
      "text": "where can i find information about relocation?",
      "intent": "QueryProcess.DisplayProcess",
      "entities": [
        {
          "entity": "process",
          "startPos": 35,
          "endPos": 44
        }
      ]
    },
    {
      "text": "show me the equipment purchasing process for wrocław.",
      "intent": "QueryProcess.DisplayProcess",
      "entities": [
        {
          "entity": "process",
          "startPos": 12,
          "endPos": 39
        },
        {
          "entity": "location",
          "startPos": 45,
          "endPos": 51
        }
      ]
    },
    {
      "text": "how do i do relocation?",
      "intent": "QueryProcess.DisplayProcess",
      "entities": [
        {
          "entity": "process",
          "startPos": 12,
          "endPos": 21
        }
      ]
    },
    {
      "text": "show me the contact person for relocations.",
      "intent": "QueryProcess.WhoIsResponsibleForProcess",
      "entities": [
        {
          "entity": "process",
          "startPos": 31,
          "endPos": 41
        }
      ]
    },
    {
      "text": "who can i talk to regarding expenses in toronto?",
      "intent": "QueryProcess.WhoIsResponsibleForProcess",
      "entities": [
        {
          "entity": "process",
          "startPos": 28,
          "endPos": 35
        },
        {
          "entity": "location",
          "startPos": 40,
          "endPos": 46
        }
      ]
    },
    {
      "text": "show me processes in wrocław",
      "intent": "QueryProcess.GetListOfProcesses",
      "entities": [
        {
          "entity": "location",
          "startPos": 21,
          "endPos": 27
        }
      ]
    },
    {
      "text": "display the whole list of processes available.",
      "intent": "QueryProcess.GetListOfProcesses",
      "entities": []
    },
    {
      "text": "what did i query yesterday",
      "intent": "QueryUserContext.DisplayQueriesFor",
      "entities": []
    },
    {
      "text": "show me all queries i made today",
      "intent": "QueryUserContext.DisplayQueriesFor",
      "entities": []
    },
    {
      "text": "could you show me my previous queries about toronto?",
      "intent": "QueryUserContext.DiplayQueriesAboutEntity",
      "entities": [
        {
          "entity": "entity",
          "startPos": 44,
          "endPos": 50
        }
      ]
    },
    {
      "text": "display all queries regarding colossus",
      "intent": "QueryUserContext.DiplayQueriesAboutEntity",
      "entities": [
        {
          "entity": "entity",
          "startPos": 30,
          "endPos": 37
        }
      ]
    },
    {
      "text": "show me my room booking queries from yesterday.",
      "intent": "QueryUserContext.DiplayQueriesAboutIntent",
      "entities": [
        {
          "entity": "intent",
          "startPos": 11,
          "endPos": 22
        }
      ]
    },
    {
      "text": "could you show me all the questions left unanswered?",
      "intent": "QueryUserContext.DisplayAllUnansweredQueries",
      "entities": []
    },
    {
      "text": "display all queries you couldn't answer.",
      "intent": "QueryUserContext.DisplayAllUnansweredQueries",
      "entities": []
    },
    {
      "text": "show unanswered questions",
      "intent": "QueryUserContext.DisplayAllUnansweredQueries",
      "entities": []
    },
    {
      "text": "list unanswered",
      "intent": "QueryUserContext.DisplayAllUnansweredQueries",
      "entities": []
    },
    {
      "text": "hi how are you?",
      "intent": "Smalltalks.Hello",
      "entities": []
    },
    {
      "text": "whats up?",
      "intent": "Smalltalks.Hello",
      "entities": []
    },
    {
      "text": "hi",
      "intent": "Smalltalks.Hello",
      "entities": []
    },
    {
      "text": "hello",
      "intent": "Smalltalks.Hello",
      "entities": []
    },
    {
      "text": "hi, please show me the options.",
      "intent": "Smalltalks.Hello",
      "entities": []
    },
    {
      "text": "hi, what you can do?",
      "intent": "Smalltalks.Hello",
      "entities": []
    },
    {
      "text": "please help me",
      "intent": "Smalltalks.Help",
      "entities": []
    },
    {
      "text": "/?",
      "intent": "Smalltalks.Help",
      "entities": []
    },
    {
      "text": "?",
      "intent": "Smalltalks.Help",
      "entities": []
    },
    {
      "text": "/help",
      "intent": "Smalltalks.Help",
      "entities": []
    },
    {
      "text": "help",
      "intent": "Smalltalks.Help",
      "entities": []
    }
  ]
}