<?xml version="1.0" encoding="UTF-8"?>
<svg xmlns="http://www.w3.org/2000/svg" xmlns:xlink="http://www.w3.org/1999/xlink" width="318pt" height="50.879997pt" viewBox="0 0 318 50.879997" version="1.1">
<defs>
<g>
<symbol overflow="visible" id="glyph0-0">
<path style="stroke:none;" d="M 1.078125 0 L 1.078125 -5.375 L 5.375 -5.375 L 5.375 0 Z M 1.203125 -0.140625 L 5.25 -0.140625 L 5.25 -5.25 L 1.203125 -5.25 Z M 1.203125 -0.140625 "/>
</symbol>
<symbol overflow="visible" id="glyph0-1">
<path style="stroke:none;" d="M -0.015625 0 L 2.359375 -6.15625 L 3.234375 -6.15625 L 5.75 0 L 4.828125 0 L 4.109375 -1.859375 L 1.53125 -1.859375 L 0.859375 0 Z M 1.765625 -2.53125 L 3.859375 -2.53125 L 3.21875 -4.234375 C 3.019531 -4.753906 2.875 -5.179688 2.78125 -5.515625 C 2.695312 -5.117188 2.582031 -4.726562 2.4375 -4.34375 Z M 1.765625 -2.53125 "/>
</symbol>
<symbol overflow="visible" id="glyph0-2">
<path style="stroke:none;" d="M 2.234375 0 L 2.234375 -5.4375 L 0.203125 -5.4375 L 0.203125 -6.15625 L 5.09375 -6.15625 L 5.09375 -5.4375 L 3.046875 -5.4375 L 3.046875 0 Z M 2.234375 0 "/>
</symbol>
<symbol overflow="visible" id="glyph0-3">
<path style="stroke:none;" d="M 5.0625 -2.15625 L 5.875 -1.953125 C 5.707031 -1.285156 5.398438 -0.773438 4.953125 -0.421875 C 4.503906 -0.0664062 3.960938 0.109375 3.328125 0.109375 C 2.660156 0.109375 2.117188 -0.0234375 1.703125 -0.296875 C 1.285156 -0.566406 0.96875 -0.957031 0.75 -1.46875 C 0.53125 -1.988281 0.421875 -2.539062 0.421875 -3.125 C 0.421875 -3.769531 0.546875 -4.332031 0.796875 -4.8125 C 1.046875 -5.289062 1.394531 -5.648438 1.84375 -5.890625 C 2.289062 -6.140625 2.789062 -6.265625 3.34375 -6.265625 C 3.957031 -6.265625 4.472656 -6.109375 4.890625 -5.796875 C 5.316406 -5.484375 5.609375 -5.039062 5.765625 -4.46875 L 4.96875 -4.28125 C 4.820312 -4.726562 4.613281 -5.050781 4.34375 -5.25 C 4.070312 -5.457031 3.734375 -5.5625 3.328125 -5.5625 C 2.847656 -5.5625 2.445312 -5.445312 2.125 -5.21875 C 1.8125 -5 1.585938 -4.695312 1.453125 -4.3125 C 1.328125 -3.925781 1.265625 -3.53125 1.265625 -3.125 C 1.265625 -2.601562 1.34375 -2.144531 1.5 -1.75 C 1.65625 -1.363281 1.890625 -1.070312 2.203125 -0.875 C 2.523438 -0.6875 2.878906 -0.59375 3.265625 -0.59375 C 3.710938 -0.59375 4.09375 -0.722656 4.40625 -0.984375 C 4.726562 -1.253906 4.945312 -1.644531 5.0625 -2.15625 Z M 5.0625 -2.15625 "/>
</symbol>
<symbol overflow="visible" id="glyph0-4">
<path style="stroke:none;" d=""/>
</symbol>
<symbol overflow="visible" id="glyph0-5">
<path style="stroke:none;" d="M 0.28125 -2.234375 C 0.28125 -3.054688 0.507812 -3.664062 0.96875 -4.0625 C 1.351562 -4.394531 1.820312 -4.5625 2.375 -4.5625 C 2.988281 -4.5625 3.488281 -4.359375 3.875 -3.953125 C 4.269531 -3.554688 4.46875 -3.003906 4.46875 -2.296875 C 4.46875 -1.722656 4.378906 -1.269531 4.203125 -0.9375 C 4.035156 -0.613281 3.785156 -0.359375 3.453125 -0.171875 C 3.128906 0.00390625 2.769531 0.09375 2.375 0.09375 C 1.75 0.09375 1.242188 -0.101562 0.859375 -0.5 C 0.472656 -0.894531 0.28125 -1.472656 0.28125 -2.234375 Z M 1.0625 -2.234375 C 1.0625 -1.660156 1.1875 -1.226562 1.4375 -0.9375 C 1.6875 -0.65625 2 -0.515625 2.375 -0.515625 C 2.75 -0.515625 3.0625 -0.65625 3.3125 -0.9375 C 3.5625 -1.226562 3.6875 -1.664062 3.6875 -2.25 C 3.6875 -2.800781 3.5625 -3.21875 3.3125 -3.5 C 3.0625 -3.789062 2.75 -3.9375 2.375 -3.9375 C 2 -3.9375 1.6875 -3.796875 1.4375 -3.515625 C 1.1875 -3.234375 1.0625 -2.804688 1.0625 -2.234375 Z M 1.0625 -2.234375 "/>
</symbol>
<symbol overflow="visible" id="glyph0-6">
<path style="stroke:none;" d="M 3.46875 0 L 3.46875 -0.5625 C 3.1875 -0.125 2.769531 0.09375 2.21875 0.09375 C 1.863281 0.09375 1.535156 0 1.234375 -0.1875 C 0.929688 -0.382812 0.695312 -0.660156 0.53125 -1.015625 C 0.375 -1.367188 0.296875 -1.773438 0.296875 -2.234375 C 0.296875 -2.671875 0.367188 -3.070312 0.515625 -3.4375 C 0.660156 -3.800781 0.878906 -4.078125 1.171875 -4.265625 C 1.472656 -4.460938 1.8125 -4.5625 2.1875 -4.5625 C 2.445312 -4.5625 2.679688 -4.503906 2.890625 -4.390625 C 3.109375 -4.273438 3.28125 -4.128906 3.40625 -3.953125 L 3.40625 -6.15625 L 4.171875 -6.15625 L 4.171875 0 Z M 1.078125 -2.234375 C 1.078125 -1.660156 1.195312 -1.226562 1.4375 -0.9375 C 1.675781 -0.65625 1.957031 -0.515625 2.28125 -0.515625 C 2.613281 -0.515625 2.894531 -0.648438 3.125 -0.921875 C 3.351562 -1.191406 3.46875 -1.609375 3.46875 -2.171875 C 3.46875 -2.773438 3.347656 -3.21875 3.109375 -3.5 C 2.878906 -3.789062 2.59375 -3.9375 2.25 -3.9375 C 1.914062 -3.9375 1.632812 -3.796875 1.40625 -3.515625 C 1.1875 -3.242188 1.078125 -2.816406 1.078125 -2.234375 Z M 1.078125 -2.234375 "/>
</symbol>
<symbol overflow="visible" id="glyph0-7">
<path style="stroke:none;" d="M 3.625 -1.4375 L 4.40625 -1.34375 C 4.28125 -0.882812 4.050781 -0.53125 3.71875 -0.28125 C 3.382812 -0.03125 2.957031 0.09375 2.4375 0.09375 C 1.789062 0.09375 1.273438 -0.101562 0.890625 -0.5 C 0.503906 -0.90625 0.3125 -1.46875 0.3125 -2.1875 C 0.3125 -2.945312 0.503906 -3.53125 0.890625 -3.9375 C 1.273438 -4.351562 1.78125 -4.5625 2.40625 -4.5625 C 3 -4.5625 3.484375 -4.359375 3.859375 -3.953125 C 4.242188 -3.546875 4.4375 -2.972656 4.4375 -2.234375 C 4.4375 -2.191406 4.429688 -2.125 4.421875 -2.03125 L 1.09375 -2.03125 C 1.125 -1.539062 1.265625 -1.164062 1.515625 -0.90625 C 1.765625 -0.644531 2.078125 -0.515625 2.453125 -0.515625 C 2.722656 -0.515625 2.957031 -0.585938 3.15625 -0.734375 C 3.351562 -0.878906 3.507812 -1.113281 3.625 -1.4375 Z M 1.140625 -2.65625 L 3.625 -2.65625 C 3.59375 -3.03125 3.5 -3.3125 3.34375 -3.5 C 3.101562 -3.789062 2.789062 -3.9375 2.40625 -3.9375 C 2.0625 -3.9375 1.769531 -3.820312 1.53125 -3.59375 C 1.289062 -3.363281 1.160156 -3.050781 1.140625 -2.65625 Z M 1.140625 -2.65625 "/>
</symbol>
<symbol overflow="visible" id="glyph0-8">
<path style="stroke:none;" d="M 2.015625 1.8125 C 1.597656 1.28125 1.242188 0.664062 0.953125 -0.03125 C 0.660156 -0.738281 0.515625 -1.472656 0.515625 -2.234375 C 0.515625 -2.898438 0.625 -3.539062 0.84375 -4.15625 C 1.09375 -4.863281 1.484375 -5.566406 2.015625 -6.265625 L 2.5625 -6.265625 C 2.21875 -5.679688 1.992188 -5.265625 1.890625 -5.015625 C 1.710938 -4.628906 1.578125 -4.226562 1.484375 -3.8125 C 1.359375 -3.28125 1.296875 -2.753906 1.296875 -2.234375 C 1.296875 -0.878906 1.71875 0.46875 2.5625 1.8125 Z M 2.015625 1.8125 "/>
</symbol>
<symbol overflow="visible" id="glyph0-9">
<path style="stroke:none;" d="M 0.546875 0 L 0.546875 -6.15625 L 1.3125 -6.15625 L 1.3125 0 Z M 0.546875 0 "/>
</symbol>
<symbol overflow="visible" id="glyph0-10">
<path style="stroke:none;" d="M 1.8125 0 L 0.109375 -4.46875 L 0.90625 -4.46875 L 1.859375 -1.796875 C 1.960938 -1.503906 2.0625 -1.203125 2.15625 -0.890625 C 2.21875 -1.128906 2.3125 -1.410156 2.4375 -1.734375 L 3.421875 -4.46875 L 4.203125 -4.46875 L 2.515625 0 Z M 1.8125 0 "/>
</symbol>
<symbol overflow="visible" id="glyph0-11">
<path style="stroke:none;" d="M 3.203125 0 L 2.453125 0 L 2.453125 -4.828125 C 2.265625 -4.648438 2.023438 -4.472656 1.734375 -4.296875 C 1.441406 -4.128906 1.175781 -4 0.9375 -3.90625 L 0.9375 -4.640625 C 1.363281 -4.835938 1.734375 -5.078125 2.046875 -5.359375 C 2.359375 -5.640625 2.582031 -5.914062 2.71875 -6.1875 L 3.203125 -6.1875 Z M 3.203125 0 "/>
</symbol>
<symbol overflow="visible" id="glyph0-12">
<path style="stroke:none;" d="M 1.0625 1.8125 L 0.515625 1.8125 C 1.359375 0.46875 1.78125 -0.878906 1.78125 -2.234375 C 1.78125 -2.753906 1.71875 -3.273438 1.59375 -3.796875 C 1.5 -4.210938 1.367188 -4.613281 1.203125 -5 C 1.085938 -5.257812 0.859375 -5.679688 0.515625 -6.265625 L 1.0625 -6.265625 C 1.59375 -5.566406 1.984375 -4.863281 2.234375 -4.15625 C 2.453125 -3.539062 2.5625 -2.898438 2.5625 -2.234375 C 2.5625 -1.472656 2.414062 -0.738281 2.125 -0.03125 C 1.832031 0.664062 1.476562 1.28125 1.0625 1.8125 Z M 1.0625 1.8125 "/>
</symbol>
<symbol overflow="visible" id="glyph0-13">
<path style="stroke:none;" d="M 4.328125 -0.734375 L 4.328125 0 L 0.265625 0 C 0.253906 -0.175781 0.28125 -0.351562 0.34375 -0.53125 C 0.445312 -0.800781 0.613281 -1.070312 0.84375 -1.34375 C 1.070312 -1.613281 1.40625 -1.925781 1.84375 -2.28125 C 2.507812 -2.832031 2.957031 -3.265625 3.1875 -3.578125 C 3.425781 -3.898438 3.546875 -4.207031 3.546875 -4.5 C 3.546875 -4.789062 3.4375 -5.039062 3.21875 -5.25 C 3.007812 -5.457031 2.734375 -5.5625 2.390625 -5.5625 C 2.023438 -5.5625 1.734375 -5.453125 1.515625 -5.234375 C 1.296875 -5.015625 1.1875 -4.710938 1.1875 -4.328125 L 0.40625 -4.40625 C 0.457031 -4.988281 0.65625 -5.429688 1 -5.734375 C 1.351562 -6.035156 1.820312 -6.1875 2.40625 -6.1875 C 3 -6.1875 3.46875 -6.019531 3.8125 -5.6875 C 4.15625 -5.363281 4.328125 -4.960938 4.328125 -4.484375 C 4.328125 -4.234375 4.273438 -3.988281 4.171875 -3.75 C 4.066406 -3.507812 3.898438 -3.257812 3.671875 -3 C 3.441406 -2.738281 3.050781 -2.375 2.5 -1.90625 C 2.050781 -1.53125 1.757812 -1.273438 1.625 -1.140625 C 1.5 -1.003906 1.394531 -0.867188 1.3125 -0.734375 Z M 4.328125 -0.734375 "/>
</symbol>
<symbol overflow="visible" id="glyph0-14">
<path style="stroke:none;" d="M 0.359375 -1.625 L 1.125 -1.734375 C 1.207031 -1.296875 1.351562 -0.984375 1.5625 -0.796875 C 1.769531 -0.609375 2.023438 -0.515625 2.328125 -0.515625 C 2.679688 -0.515625 2.976562 -0.632812 3.21875 -0.875 C 3.46875 -1.125 3.59375 -1.429688 3.59375 -1.796875 C 3.59375 -2.148438 3.476562 -2.4375 3.25 -2.65625 C 3.019531 -2.882812 2.734375 -3 2.390625 -3 C 2.242188 -3 2.066406 -2.972656 1.859375 -2.921875 L 1.9375 -3.578125 C 1.988281 -3.578125 2.03125 -3.578125 2.0625 -3.578125 C 2.382812 -3.578125 2.671875 -3.660156 2.921875 -3.828125 C 3.179688 -3.992188 3.3125 -4.253906 3.3125 -4.609375 C 3.3125 -4.878906 3.21875 -5.101562 3.03125 -5.28125 C 2.84375 -5.46875 2.601562 -5.5625 2.3125 -5.5625 C 2.007812 -5.5625 1.757812 -5.46875 1.5625 -5.28125 C 1.375 -5.101562 1.25 -4.828125 1.1875 -4.453125 L 0.4375 -4.59375 C 0.53125 -5.09375 0.738281 -5.484375 1.0625 -5.765625 C 1.394531 -6.046875 1.804688 -6.1875 2.296875 -6.1875 C 2.628906 -6.1875 2.9375 -6.113281 3.21875 -5.96875 C 3.5 -5.820312 3.710938 -5.625 3.859375 -5.375 C 4.015625 -5.125 4.09375 -4.863281 4.09375 -4.59375 C 4.09375 -4.320312 4.019531 -4.078125 3.875 -3.859375 C 3.738281 -3.640625 3.53125 -3.46875 3.25 -3.34375 C 3.613281 -3.257812 3.894531 -3.082031 4.09375 -2.8125 C 4.289062 -2.550781 4.390625 -2.21875 4.390625 -1.8125 C 4.390625 -1.28125 4.191406 -0.828125 3.796875 -0.453125 C 3.410156 -0.078125 2.921875 0.109375 2.328125 0.109375 C 1.785156 0.109375 1.332031 -0.0507812 0.96875 -0.375 C 0.613281 -0.695312 0.410156 -1.113281 0.359375 -1.625 Z M 0.359375 -1.625 "/>
</symbol>
<symbol overflow="visible" id="glyph0-15">
<path style="stroke:none;" d="M 2.78125 0 L 2.78125 -1.46875 L 0.109375 -1.46875 L 0.109375 -2.171875 L 2.921875 -6.15625 L 3.546875 -6.15625 L 3.546875 -2.171875 L 4.375 -2.171875 L 4.375 -1.46875 L 3.546875 -1.46875 L 3.546875 0 Z M 2.78125 -2.171875 L 2.78125 -4.953125 L 0.859375 -2.171875 Z M 2.78125 -2.171875 "/>
</symbol>
<symbol overflow="visible" id="glyph0-16">
<path style="stroke:none;" d="M 0.359375 -1.609375 L 1.15625 -1.6875 C 1.207031 -1.289062 1.34375 -0.992188 1.5625 -0.796875 C 1.78125 -0.609375 2.039062 -0.515625 2.34375 -0.515625 C 2.707031 -0.515625 3.015625 -0.648438 3.265625 -0.921875 C 3.515625 -1.203125 3.640625 -1.566406 3.640625 -2.015625 C 3.640625 -2.453125 3.515625 -2.796875 3.265625 -3.046875 C 3.023438 -3.296875 2.710938 -3.421875 2.328125 -3.421875 C 2.078125 -3.421875 1.851562 -3.363281 1.65625 -3.25 C 1.46875 -3.132812 1.316406 -2.992188 1.203125 -2.828125 L 0.484375 -2.90625 L 1.09375 -6.078125 L 4.15625 -6.078125 L 4.15625 -5.359375 L 1.6875 -5.359375 L 1.359375 -3.703125 C 1.734375 -3.960938 2.125 -4.09375 2.53125 -4.09375 C 3.0625 -4.09375 3.507812 -3.90625 3.875 -3.53125 C 4.25 -3.15625 4.4375 -2.675781 4.4375 -2.09375 C 4.4375 -1.53125 4.273438 -1.046875 3.953125 -0.640625 C 3.554688 -0.140625 3.019531 0.109375 2.34375 0.109375 C 1.78125 0.109375 1.320312 -0.046875 0.96875 -0.359375 C 0.613281 -0.679688 0.410156 -1.097656 0.359375 -1.609375 Z M 0.359375 -1.609375 "/>
</symbol>
<symbol overflow="visible" id="glyph1-0">
<path style="stroke:none;" d="M 0.984375 0 L 0.984375 -4.9375 L 4.9375 -4.9375 L 4.9375 0 Z M 1.109375 -0.125 L 4.8125 -0.125 L 4.8125 -4.8125 L 1.109375 -4.8125 Z M 1.109375 -0.125 "/>
</symbol>
<symbol overflow="visible" id="glyph1-1">
<path style="stroke:none;" d="M 0.25 -1.21875 L 0.921875 -1.328125 C 0.960938 -1.054688 1.070312 -0.847656 1.25 -0.703125 C 1.425781 -0.554688 1.671875 -0.484375 1.984375 -0.484375 C 2.304688 -0.484375 2.539062 -0.546875 2.6875 -0.671875 C 2.84375 -0.796875 2.921875 -0.945312 2.921875 -1.125 C 2.921875 -1.28125 2.851562 -1.40625 2.71875 -1.5 C 2.625 -1.5625 2.390625 -1.640625 2.015625 -1.734375 C 1.503906 -1.859375 1.148438 -1.96875 0.953125 -2.0625 C 0.753906 -2.15625 0.601562 -2.285156 0.5 -2.453125 C 0.40625 -2.617188 0.359375 -2.800781 0.359375 -3 C 0.359375 -3.1875 0.398438 -3.359375 0.484375 -3.515625 C 0.566406 -3.671875 0.679688 -3.800781 0.828125 -3.90625 C 0.929688 -3.976562 1.078125 -4.039062 1.265625 -4.09375 C 1.453125 -4.15625 1.648438 -4.1875 1.859375 -4.1875 C 2.179688 -4.1875 2.460938 -4.140625 2.703125 -4.046875 C 2.953125 -3.953125 3.132812 -3.828125 3.25 -3.671875 C 3.363281 -3.515625 3.441406 -3.300781 3.484375 -3.03125 L 2.8125 -2.9375 C 2.78125 -3.15625 2.6875 -3.320312 2.53125 -3.4375 C 2.382812 -3.550781 2.179688 -3.609375 1.921875 -3.609375 C 1.597656 -3.609375 1.367188 -3.554688 1.234375 -3.453125 C 1.097656 -3.347656 1.03125 -3.226562 1.03125 -3.09375 C 1.03125 -3 1.054688 -2.914062 1.109375 -2.84375 C 1.171875 -2.769531 1.257812 -2.707031 1.375 -2.65625 C 1.445312 -2.632812 1.648438 -2.578125 1.984375 -2.484375 C 2.484375 -2.347656 2.828125 -2.238281 3.015625 -2.15625 C 3.210938 -2.070312 3.363281 -1.953125 3.46875 -1.796875 C 3.582031 -1.640625 3.640625 -1.441406 3.640625 -1.203125 C 3.640625 -0.972656 3.570312 -0.753906 3.4375 -0.546875 C 3.300781 -0.347656 3.101562 -0.191406 2.84375 -0.078125 C 2.59375 0.0351562 2.304688 0.09375 1.984375 0.09375 C 1.453125 0.09375 1.046875 -0.015625 0.765625 -0.234375 C 0.492188 -0.453125 0.320312 -0.78125 0.25 -1.21875 Z M 0.25 -1.21875 "/>
</symbol>
<symbol overflow="visible" id="glyph1-2">
<path style="stroke:none;" d="M 3.203125 0 L 3.203125 -0.59375 C 2.878906 -0.132812 2.445312 0.09375 1.90625 0.09375 C 1.664062 0.09375 1.4375 0.046875 1.21875 -0.046875 C 1.007812 -0.140625 0.851562 -0.253906 0.75 -0.390625 C 0.65625 -0.535156 0.585938 -0.707031 0.546875 -0.90625 C 0.515625 -1.039062 0.5 -1.257812 0.5 -1.5625 L 0.5 -4.09375 L 1.203125 -4.09375 L 1.203125 -1.828125 C 1.203125 -1.460938 1.210938 -1.21875 1.234375 -1.09375 C 1.285156 -0.90625 1.378906 -0.757812 1.515625 -0.65625 C 1.660156 -0.550781 1.835938 -0.5 2.046875 -0.5 C 2.253906 -0.5 2.445312 -0.550781 2.625 -0.65625 C 2.8125 -0.769531 2.941406 -0.914062 3.015625 -1.09375 C 3.085938 -1.28125 3.125 -1.550781 3.125 -1.90625 L 3.125 -4.09375 L 3.828125 -4.09375 L 3.828125 0 Z M 3.203125 0 "/>
</symbol>
<symbol overflow="visible" id="glyph1-3">
<path style="stroke:none;" d="M 1.15625 0 L 0.515625 0 L 0.515625 -5.640625 L 1.203125 -5.640625 L 1.203125 -3.640625 C 1.503906 -4.003906 1.878906 -4.1875 2.328125 -4.1875 C 2.578125 -4.1875 2.8125 -4.132812 3.03125 -4.03125 C 3.257812 -3.925781 3.445312 -3.78125 3.59375 -3.59375 C 3.738281 -3.414062 3.851562 -3.195312 3.9375 -2.9375 C 4.019531 -2.675781 4.0625 -2.398438 4.0625 -2.109375 C 4.0625 -1.410156 3.890625 -0.867188 3.546875 -0.484375 C 3.203125 -0.0976562 2.785156 0.09375 2.296875 0.09375 C 1.816406 0.09375 1.4375 -0.109375 1.15625 -0.515625 Z M 1.15625 -2.078125 C 1.15625 -1.585938 1.222656 -1.234375 1.359375 -1.015625 C 1.578125 -0.660156 1.867188 -0.484375 2.234375 -0.484375 C 2.535156 -0.484375 2.796875 -0.613281 3.015625 -0.875 C 3.242188 -1.132812 3.359375 -1.523438 3.359375 -2.046875 C 3.359375 -2.578125 3.25 -2.96875 3.03125 -3.21875 C 2.820312 -3.476562 2.566406 -3.609375 2.265625 -3.609375 C 1.960938 -3.609375 1.703125 -3.476562 1.484375 -3.21875 C 1.265625 -2.957031 1.15625 -2.578125 1.15625 -2.078125 Z M 1.15625 -2.078125 "/>
</symbol>
<symbol overflow="visible" id="glyph1-4">
<path style="stroke:none;" d="M 4.640625 -1.984375 L 5.390625 -1.796875 C 5.234375 -1.179688 4.953125 -0.710938 4.546875 -0.390625 C 4.140625 -0.0664062 3.640625 0.09375 3.046875 0.09375 C 2.441406 0.09375 1.945312 -0.0234375 1.5625 -0.265625 C 1.175781 -0.515625 0.882812 -0.875 0.6875 -1.34375 C 0.488281 -1.820312 0.390625 -2.328125 0.390625 -2.859375 C 0.390625 -3.453125 0.5 -3.96875 0.71875 -4.40625 C 0.945312 -4.84375 1.269531 -5.175781 1.6875 -5.40625 C 2.101562 -5.632812 2.5625 -5.75 3.0625 -5.75 C 3.625 -5.75 4.097656 -5.601562 4.484375 -5.3125 C 4.867188 -5.019531 5.140625 -4.613281 5.296875 -4.09375 L 4.546875 -3.921875 C 4.421875 -4.335938 4.234375 -4.640625 3.984375 -4.828125 C 3.734375 -5.015625 3.421875 -5.109375 3.046875 -5.109375 C 2.609375 -5.109375 2.242188 -5.003906 1.953125 -4.796875 C 1.660156 -4.585938 1.453125 -4.304688 1.328125 -3.953125 C 1.210938 -3.597656 1.15625 -3.238281 1.15625 -2.875 C 1.15625 -2.394531 1.222656 -1.972656 1.359375 -1.609375 C 1.503906 -1.253906 1.722656 -0.988281 2.015625 -0.8125 C 2.316406 -0.632812 2.640625 -0.546875 2.984375 -0.546875 C 3.398438 -0.546875 3.753906 -0.664062 4.046875 -0.90625 C 4.335938 -1.144531 4.535156 -1.503906 4.640625 -1.984375 Z M 4.640625 -1.984375 "/>
</symbol>
<symbol overflow="visible" id="glyph1-5">
<path style="stroke:none;" d="M 0.5 0 L 0.5 -5.640625 L 1.203125 -5.640625 L 1.203125 0 Z M 0.5 0 "/>
</symbol>
<symbol overflow="visible" id="glyph1-6">
<path style="stroke:none;" d="M 3.1875 -0.5 C 2.9375 -0.28125 2.691406 -0.125 2.453125 -0.03125 C 2.210938 0.0507812 1.957031 0.09375 1.6875 0.09375 C 1.238281 0.09375 0.890625 -0.015625 0.640625 -0.234375 C 0.398438 -0.453125 0.28125 -0.734375 0.28125 -1.078125 C 0.28125 -1.273438 0.328125 -1.457031 0.421875 -1.625 C 0.515625 -1.789062 0.632812 -1.921875 0.78125 -2.015625 C 0.925781 -2.117188 1.09375 -2.195312 1.28125 -2.25 C 1.414062 -2.289062 1.617188 -2.328125 1.890625 -2.359375 C 2.453125 -2.421875 2.863281 -2.5 3.125 -2.59375 C 3.132812 -2.6875 3.140625 -2.75 3.140625 -2.78125 C 3.140625 -3.0625 3.070312 -3.257812 2.9375 -3.375 C 2.757812 -3.53125 2.5 -3.609375 2.15625 -3.609375 C 1.820312 -3.609375 1.578125 -3.550781 1.421875 -3.4375 C 1.265625 -3.320312 1.148438 -3.117188 1.078125 -2.828125 L 0.40625 -2.921875 C 0.46875 -3.210938 0.566406 -3.445312 0.703125 -3.625 C 0.847656 -3.800781 1.050781 -3.9375 1.3125 -4.03125 C 1.582031 -4.132812 1.894531 -4.1875 2.25 -4.1875 C 2.601562 -4.1875 2.882812 -4.144531 3.09375 -4.0625 C 3.3125 -3.976562 3.472656 -3.875 3.578125 -3.75 C 3.679688 -3.625 3.753906 -3.46875 3.796875 -3.28125 C 3.816406 -3.15625 3.828125 -2.941406 3.828125 -2.640625 L 3.828125 -1.71875 C 3.828125 -1.070312 3.84375 -0.660156 3.875 -0.484375 C 3.90625 -0.316406 3.960938 -0.15625 4.046875 0 L 3.328125 0 C 3.253906 -0.144531 3.207031 -0.3125 3.1875 -0.5 Z M 3.125 -2.046875 C 2.875 -1.953125 2.5 -1.867188 2 -1.796875 C 1.71875 -1.753906 1.515625 -1.707031 1.390625 -1.65625 C 1.273438 -1.601562 1.1875 -1.523438 1.125 -1.421875 C 1.0625 -1.328125 1.03125 -1.21875 1.03125 -1.09375 C 1.03125 -0.914062 1.097656 -0.765625 1.234375 -0.640625 C 1.367188 -0.515625 1.570312 -0.453125 1.84375 -0.453125 C 2.113281 -0.453125 2.351562 -0.507812 2.5625 -0.625 C 2.769531 -0.738281 2.921875 -0.898438 3.015625 -1.109375 C 3.085938 -1.265625 3.125 -1.492188 3.125 -1.796875 Z M 3.125 -2.046875 "/>
</symbol>
<symbol overflow="visible" id="glyph1-7">
<path style="stroke:none;" d="M 0.375 -2.75 C 0.375 -3.6875 0.625 -4.421875 1.125 -4.953125 C 1.632812 -5.484375 2.289062 -5.75 3.09375 -5.75 C 3.613281 -5.75 4.082031 -5.625 4.5 -5.375 C 4.914062 -5.125 5.234375 -4.773438 5.453125 -4.328125 C 5.671875 -3.878906 5.78125 -3.375 5.78125 -2.8125 C 5.78125 -2.238281 5.664062 -1.722656 5.4375 -1.265625 C 5.207031 -0.816406 4.878906 -0.476562 4.453125 -0.25 C 4.023438 -0.0195312 3.566406 0.09375 3.078125 0.09375 C 2.546875 0.09375 2.070312 -0.03125 1.65625 -0.28125 C 1.238281 -0.539062 0.921875 -0.890625 0.703125 -1.328125 C 0.484375 -1.773438 0.375 -2.25 0.375 -2.75 Z M 1.15625 -2.734375 C 1.15625 -2.054688 1.335938 -1.519531 1.703125 -1.125 C 2.066406 -0.738281 2.523438 -0.546875 3.078125 -0.546875 C 3.640625 -0.546875 4.101562 -0.742188 4.46875 -1.140625 C 4.832031 -1.535156 5.015625 -2.09375 5.015625 -2.8125 C 5.015625 -3.28125 4.9375 -3.679688 4.78125 -4.015625 C 4.625 -4.359375 4.394531 -4.625 4.09375 -4.8125 C 3.800781 -5.007812 3.46875 -5.109375 3.09375 -5.109375 C 2.5625 -5.109375 2.101562 -4.925781 1.71875 -4.5625 C 1.34375 -4.195312 1.15625 -3.585938 1.15625 -2.734375 Z M 1.15625 -2.734375 "/>
</symbol>
<symbol overflow="visible" id="glyph1-8">
<path style="stroke:none;" d="M 0.6875 0 L 0.6875 -3.546875 L 0.078125 -3.546875 L 0.078125 -4.09375 L 0.6875 -4.09375 L 0.6875 -4.53125 C 0.6875 -4.800781 0.710938 -5.003906 0.765625 -5.140625 C 0.828125 -5.316406 0.941406 -5.460938 1.109375 -5.578125 C 1.273438 -5.691406 1.507812 -5.75 1.8125 -5.75 C 2.007812 -5.75 2.226562 -5.722656 2.46875 -5.671875 L 2.359375 -5.078125 C 2.210938 -5.097656 2.078125 -5.109375 1.953125 -5.109375 C 1.742188 -5.109375 1.59375 -5.0625 1.5 -4.96875 C 1.414062 -4.882812 1.375 -4.71875 1.375 -4.46875 L 1.375 -4.09375 L 2.171875 -4.09375 L 2.171875 -3.546875 L 1.375 -3.546875 L 1.375 0 Z M 0.6875 0 "/>
</symbol>
</g>
<clipPath id="clip1">
  <path d="M 0 0 L 318 0 L 318 50.878906 L 0 50.878906 Z M 0 0 "/>
</clipPath>
<clipPath id="clip2">
  <path d="M 1 20 L 59 20 L 59 49.53125 L 1 49.53125 Z M 1 20 "/>
</clipPath>
<clipPath id="clip3">
  <path d="M 0 20 L 59 20 L 59 49.53125 L 0 49.53125 Z M 0 20 "/>
</clipPath>
<clipPath id="clip4">
  <path d="M 65 20 L 124 20 L 124 49.53125 L 65 49.53125 Z M 65 20 "/>
</clipPath>
<clipPath id="clip5">
  <path d="M 130 20 L 188 20 L 188 49.53125 L 130 49.53125 Z M 130 20 "/>
</clipPath>
<clipPath id="clip6">
  <path d="M 129 20 L 189 20 L 189 49.53125 L 129 49.53125 Z M 129 20 "/>
</clipPath>
<clipPath id="clip7">
  <path d="M 194 20 L 253 20 L 253 49.53125 L 194 49.53125 Z M 194 20 "/>
</clipPath>
<clipPath id="clip8">
  <path d="M 259 20 L 317 20 L 317 49.53125 L 259 49.53125 Z M 259 20 "/>
</clipPath>
<clipPath id="clip9">
  <path d="M 259 20 L 318 20 L 318 49.53125 L 259 49.53125 Z M 259 20 "/>
</clipPath>
</defs>
<g id="surface1">
<g clip-path="url(#clip1)" clip-rule="nonzero">
<path style=" stroke:none;fill-rule:nonzero;fill:rgb(100%,100%,100%);fill-opacity:1;" d="M 0 0 L 318 0 L 318 50.964844 L 0 50.964844 Z M 0 0 "/>
</g>
<g clip-path="url(#clip2)" clip-rule="nonzero">
<path style=" stroke:none;fill-rule:nonzero;fill:rgb(68.629456%,80.389404%,87.838745%);fill-opacity:1;" d="M 1.078125 20.457031 L 58.503906 20.457031 L 58.503906 49.171875 L 1.078125 49.171875 Z M 1.078125 20.457031 "/>
</g>
<g clip-path="url(#clip3)" clip-rule="nonzero">
<path style="fill:none;stroke-width:1;stroke-linecap:butt;stroke-linejoin:miter;stroke:rgb(18.818665%,38.42926%,47.059631%);stroke-opacity:1;stroke-miterlimit:4;" d="M 1.001916 27.998319 L 81.00073 27.998319 L 81.00073 68.000446 L 1.001916 68.000446 Z M 1.001916 27.998319 " transform="matrix(0.717833,0,0,0.717833,0.358916,0.358916)"/>
</g>
<g style="fill:rgb(18.818665%,38.42926%,47.059631%);fill-opacity:1;">
  <use xlink:href="#glyph0-1" x="9.634664" y="33.020314"/>
</g>
<g style="fill:rgb(18.818665%,38.42926%,47.059631%);fill-opacity:1;">
  <use xlink:href="#glyph0-2" x="14.740811" y="33.020314"/>
  <use xlink:href="#glyph0-3" x="20.002582" y="33.020314"/>
  <use xlink:href="#glyph0-4" x="26.223334" y="33.020314"/>
  <use xlink:href="#glyph0-3" x="28.616577" y="33.020314"/>
  <use xlink:href="#glyph0-5" x="34.837329" y="33.020314"/>
  <use xlink:href="#glyph0-6" x="39.628022" y="33.020314"/>
  <use xlink:href="#glyph0-7" x="44.418716" y="33.020314"/>
</g>
<g style="fill:rgb(18.818665%,38.42926%,47.059631%);fill-opacity:1;">
  <use xlink:href="#glyph0-8" x="14.109903" y="43.069975"/>
  <use xlink:href="#glyph0-9" x="16.978431" y="43.069975"/>
  <use xlink:href="#glyph0-7" x="18.892185" y="43.069975"/>
  <use xlink:href="#glyph0-10" x="23.682878" y="43.069975"/>
  <use xlink:href="#glyph0-7" x="27.989876" y="43.069975"/>
  <use xlink:href="#glyph0-9" x="32.780569" y="43.069975"/>
  <use xlink:href="#glyph0-4" x="34.694323" y="43.069975"/>
  <use xlink:href="#glyph0-11" x="37.087566" y="43.069975"/>
  <use xlink:href="#glyph0-12" x="41.87826" y="43.069975"/>
</g>
<g clip-path="url(#clip4)" clip-rule="nonzero">
<path style="fill-rule:nonzero;fill:rgb(68.629456%,80.389404%,87.838745%);fill-opacity:1;stroke-width:1;stroke-linecap:butt;stroke-linejoin:miter;stroke:rgb(18.818665%,38.42926%,47.059631%);stroke-opacity:1;stroke-miterlimit:4;" d="M 91.002622 27.998319 L 171.001435 27.998319 L 171.001435 68.000446 L 91.002622 68.000446 Z M 91.002622 27.998319 " transform="matrix(0.717833,0,0,0.717833,0.358916,0.358916)"/>
</g>
<g style="fill:rgb(18.818665%,38.42926%,47.059631%);fill-opacity:1;">
  <use xlink:href="#glyph0-1" x="74.239626" y="33.020314"/>
</g>
<g style="fill:rgb(18.818665%,38.42926%,47.059631%);fill-opacity:1;">
  <use xlink:href="#glyph0-2" x="79.345773" y="33.020314"/>
  <use xlink:href="#glyph0-3" x="84.607545" y="33.020314"/>
  <use xlink:href="#glyph0-4" x="90.828296" y="33.020314"/>
  <use xlink:href="#glyph0-3" x="93.22154" y="33.020314"/>
  <use xlink:href="#glyph0-5" x="99.442291" y="33.020314"/>
  <use xlink:href="#glyph0-6" x="104.232984" y="33.020314"/>
  <use xlink:href="#glyph0-7" x="109.023678" y="33.020314"/>
</g>
<g style="fill:rgb(18.818665%,38.42926%,47.059631%);fill-opacity:1;">
  <use xlink:href="#glyph0-8" x="78.714865" y="43.069975"/>
  <use xlink:href="#glyph0-9" x="81.583393" y="43.069975"/>
  <use xlink:href="#glyph0-7" x="83.497147" y="43.069975"/>
  <use xlink:href="#glyph0-10" x="88.28784" y="43.069975"/>
  <use xlink:href="#glyph0-7" x="92.594838" y="43.069975"/>
  <use xlink:href="#glyph0-9" x="97.385531" y="43.069975"/>
  <use xlink:href="#glyph0-4" x="99.299285" y="43.069975"/>
  <use xlink:href="#glyph0-13" x="101.692529" y="43.069975"/>
  <use xlink:href="#glyph0-12" x="106.483222" y="43.069975"/>
</g>
<g clip-path="url(#clip5)" clip-rule="nonzero">
<path style=" stroke:none;fill-rule:nonzero;fill:rgb(68.629456%,80.389404%,87.838745%);fill-opacity:1;" d="M 130.285156 20.457031 L 187.714844 20.457031 L 187.714844 49.171875 L 130.285156 49.171875 Z M 130.285156 20.457031 "/>
</g>
<g clip-path="url(#clip6)" clip-rule="nonzero">
<path style="fill:none;stroke-width:1;stroke-linecap:butt;stroke-linejoin:miter;stroke:rgb(18.818665%,38.42926%,47.059631%);stroke-opacity:1;stroke-miterlimit:4;" d="M 180.997886 27.998319 L 261.002141 27.998319 L 261.002141 68.000446 L 180.997886 68.000446 Z M 180.997886 27.998319 " transform="matrix(0.717833,0,0,0.717833,0.358916,0.358916)"/>
</g>
<g style="fill:rgb(18.818665%,38.42926%,47.059631%);fill-opacity:1;">
  <use xlink:href="#glyph0-1" x="138.844592" y="33.020314"/>
</g>
<g style="fill:rgb(18.818665%,38.42926%,47.059631%);fill-opacity:1;">
  <use xlink:href="#glyph0-2" x="143.950739" y="33.020314"/>
  <use xlink:href="#glyph0-3" x="149.212511" y="33.020314"/>
  <use xlink:href="#glyph0-4" x="155.433262" y="33.020314"/>
  <use xlink:href="#glyph0-3" x="157.826505" y="33.020314"/>
  <use xlink:href="#glyph0-5" x="164.047257" y="33.020314"/>
  <use xlink:href="#glyph0-6" x="168.83795" y="33.020314"/>
  <use xlink:href="#glyph0-7" x="173.628644" y="33.020314"/>
</g>
<g style="fill:rgb(18.818665%,38.42926%,47.059631%);fill-opacity:1;">
  <use xlink:href="#glyph0-8" x="143.319828" y="43.069975"/>
  <use xlink:href="#glyph0-9" x="146.188355" y="43.069975"/>
  <use xlink:href="#glyph0-7" x="148.102109" y="43.069975"/>
  <use xlink:href="#glyph0-10" x="152.892803" y="43.069975"/>
  <use xlink:href="#glyph0-7" x="157.1998" y="43.069975"/>
  <use xlink:href="#glyph0-9" x="161.990494" y="43.069975"/>
  <use xlink:href="#glyph0-4" x="163.904247" y="43.069975"/>
  <use xlink:href="#glyph0-14" x="166.297491" y="43.069975"/>
  <use xlink:href="#glyph0-12" x="171.088184" y="43.069975"/>
</g>
<g clip-path="url(#clip7)" clip-rule="nonzero">
<path style="fill-rule:nonzero;fill:rgb(68.629456%,80.389404%,87.838745%);fill-opacity:1;stroke-width:1;stroke-linecap:butt;stroke-linejoin:miter;stroke:rgb(18.818665%,38.42926%,47.059631%);stroke-opacity:1;stroke-miterlimit:4;" d="M 270.998591 27.998319 L 350.997405 27.998319 L 350.997405 68.000446 L 270.998591 68.000446 Z M 270.998591 27.998319 " transform="matrix(0.717833,0,0,0.717833,0.358916,0.358916)"/>
</g>
<g style="fill:rgb(18.818665%,38.42926%,47.059631%);fill-opacity:1;">
  <use xlink:href="#glyph0-1" x="203.449554" y="33.020314"/>
</g>
<g style="fill:rgb(18.818665%,38.42926%,47.059631%);fill-opacity:1;">
  <use xlink:href="#glyph0-2" x="208.555701" y="33.020314"/>
  <use xlink:href="#glyph0-3" x="213.817473" y="33.020314"/>
  <use xlink:href="#glyph0-4" x="220.038224" y="33.020314"/>
  <use xlink:href="#glyph0-3" x="222.431468" y="33.020314"/>
  <use xlink:href="#glyph0-5" x="228.652219" y="33.020314"/>
  <use xlink:href="#glyph0-6" x="233.442912" y="33.020314"/>
  <use xlink:href="#glyph0-7" x="238.233606" y="33.020314"/>
</g>
<g style="fill:rgb(18.818665%,38.42926%,47.059631%);fill-opacity:1;">
  <use xlink:href="#glyph0-8" x="207.92479" y="43.069975"/>
  <use xlink:href="#glyph0-9" x="210.793318" y="43.069975"/>
  <use xlink:href="#glyph0-7" x="212.707071" y="43.069975"/>
  <use xlink:href="#glyph0-10" x="217.497765" y="43.069975"/>
  <use xlink:href="#glyph0-7" x="221.804762" y="43.069975"/>
  <use xlink:href="#glyph0-9" x="226.595456" y="43.069975"/>
  <use xlink:href="#glyph0-4" x="228.50921" y="43.069975"/>
  <use xlink:href="#glyph0-15" x="230.902453" y="43.069975"/>
  <use xlink:href="#glyph0-12" x="235.693147" y="43.069975"/>
</g>
<path style="fill:none;stroke-width:1;stroke-linecap:butt;stroke-linejoin:miter;stroke:rgb(0%,0%,0%);stroke-opacity:1;stroke-miterlimit:10;" d="M 401.001424 27.998319 L 401.001424 18.001868 C 401.001424 11.335754 397.665646 7.999976 390.999532 7.999976 L 341.000954 7.999976 C 334.33484 7.999976 330.999062 10.274617 330.999062 14.818459 L 330.999062 21.631499 " transform="matrix(0.717833,0,0,0.717833,0.358916,0.358916)"/>
<path style="fill-rule:nonzero;fill:rgb(0%,0%,0%);fill-opacity:1;stroke-width:1;stroke-linecap:butt;stroke-linejoin:miter;stroke:rgb(0%,0%,0%);stroke-opacity:1;stroke-miterlimit:10;" d="M 330.999062 26.877323 L 327.500032 19.879264 L 330.999062 21.631499 L 334.498092 19.879264 Z M 330.999062 26.877323 " transform="matrix(0.717833,0,0,0.717833,0.358916,0.358916)"/>
<path style=" stroke:none;fill-rule:nonzero;fill:rgb(100%,100%,100%);fill-opacity:1;" d="M 239.039062 0.71875 L 279.953125 0.71875 L 279.953125 10.050781 L 239.039062 10.050781 Z M 239.039062 0.71875 "/>
<g style="fill:rgb(39.219666%,38.819885%,38.819885%);fill-opacity:1;">
  <use xlink:href="#glyph1-1" x="239.094445" y="7.896162"/>
  <use xlink:href="#glyph1-2" x="243.042526" y="7.896162"/>
  <use xlink:href="#glyph1-3" x="247.433995" y="7.896162"/>
  <use xlink:href="#glyph1-4" x="251.825464" y="7.896162"/>
  <use xlink:href="#glyph1-5" x="257.527819" y="7.896162"/>
  <use xlink:href="#glyph1-6" x="259.282093" y="7.896162"/>
  <use xlink:href="#glyph1-1" x="263.673562" y="7.896162"/>
  <use xlink:href="#glyph1-1" x="267.621643" y="7.896162"/>
  <use xlink:href="#glyph1-7" x="271.569724" y="7.896162"/>
  <use xlink:href="#glyph1-8" x="277.711612" y="7.896162"/>
</g>
<g clip-path="url(#clip8)" clip-rule="nonzero">
<path style=" stroke:none;fill-rule:nonzero;fill:rgb(68.629456%,80.389404%,87.838745%);fill-opacity:1;" d="M 259.496094 20.457031 L 316.921875 20.457031 L 316.921875 49.171875 L 259.496094 49.171875 Z M 259.496094 20.457031 "/>
</g>
<g clip-path="url(#clip9)" clip-rule="nonzero">
<path style="fill:none;stroke-width:1;stroke-linecap:butt;stroke-linejoin:miter;stroke:rgb(18.818665%,38.42926%,47.059631%);stroke-opacity:1;stroke-miterlimit:4;" d="M 360.999297 27.998319 L 440.99811 27.998319 L 440.99811 68.000446 L 360.999297 68.000446 Z M 360.999297 27.998319 " transform="matrix(0.717833,0,0,0.717833,0.358916,0.358916)"/>
</g>
<g style="fill:rgb(18.818665%,38.42926%,47.059631%);fill-opacity:1;">
  <use xlink:href="#glyph0-1" x="268.054516" y="33.020314"/>
</g>
<g style="fill:rgb(18.818665%,38.42926%,47.059631%);fill-opacity:1;">
  <use xlink:href="#glyph0-2" x="273.160664" y="33.020314"/>
  <use xlink:href="#glyph0-3" x="278.422435" y="33.020314"/>
  <use xlink:href="#glyph0-4" x="284.643186" y="33.020314"/>
  <use xlink:href="#glyph0-3" x="287.03643" y="33.020314"/>
  <use xlink:href="#glyph0-5" x="293.257181" y="33.020314"/>
  <use xlink:href="#glyph0-6" x="298.047875" y="33.020314"/>
  <use xlink:href="#glyph0-7" x="302.838568" y="33.020314"/>
</g>
<g style="fill:rgb(18.818665%,38.42926%,47.059631%);fill-opacity:1;">
  <use xlink:href="#glyph0-8" x="272.529752" y="43.069975"/>
  <use xlink:href="#glyph0-9" x="275.39828" y="43.069975"/>
  <use xlink:href="#glyph0-7" x="277.312034" y="43.069975"/>
  <use xlink:href="#glyph0-10" x="282.102727" y="43.069975"/>
  <use xlink:href="#glyph0-7" x="286.409725" y="43.069975"/>
  <use xlink:href="#glyph0-9" x="291.200418" y="43.069975"/>
  <use xlink:href="#glyph0-4" x="293.114172" y="43.069975"/>
  <use xlink:href="#glyph0-16" x="295.507416" y="43.069975"/>
  <use xlink:href="#glyph0-12" x="300.298109" y="43.069975"/>
</g>
<path style="fill:none;stroke-width:1;stroke-linecap:butt;stroke-linejoin:miter;stroke:rgb(0%,0%,0%);stroke-opacity:1;stroke-miterlimit:10;" d="M 291.002376 27.998319 L 291.002376 18.001868 C 291.002376 11.335754 287.666598 7.999976 281.000484 7.999976 L 231.001906 7.999976 C 224.335791 7.999976 221.000013 10.274617 221.000013 14.818459 L 221.000013 21.631499 " transform="matrix(0.717833,0,0,0.717833,0.358916,0.358916)"/>
<path style="fill-rule:nonzero;fill:rgb(0%,0%,0%);fill-opacity:1;stroke-width:1;stroke-linecap:butt;stroke-linejoin:miter;stroke:rgb(0%,0%,0%);stroke-opacity:1;stroke-miterlimit:10;" d="M 221.000013 26.877323 L 217.500983 19.879264 L 221.000013 21.631499 L 224.499043 19.879264 Z M 221.000013 26.877323 " transform="matrix(0.717833,0,0,0.717833,0.358916,0.358916)"/>
<path style=" stroke:none;fill-rule:nonzero;fill:rgb(100%,100%,100%);fill-opacity:1;" d="M 160.078125 0.71875 L 200.992188 0.71875 L 200.992188 10.050781 L 160.078125 10.050781 Z M 160.078125 0.71875 "/>
<g style="fill:rgb(39.219666%,38.819885%,38.819885%);fill-opacity:1;">
  <use xlink:href="#glyph1-1" x="160.132824" y="7.896162"/>
  <use xlink:href="#glyph1-2" x="164.080905" y="7.896162"/>
  <use xlink:href="#glyph1-3" x="168.472374" y="7.896162"/>
  <use xlink:href="#glyph1-4" x="172.863843" y="7.896162"/>
  <use xlink:href="#glyph1-5" x="178.566198" y="7.896162"/>
  <use xlink:href="#glyph1-6" x="180.320473" y="7.896162"/>
  <use xlink:href="#glyph1-1" x="184.711942" y="7.896162"/>
  <use xlink:href="#glyph1-1" x="188.660023" y="7.896162"/>
  <use xlink:href="#glyph1-7" x="192.608104" y="7.896162"/>
  <use xlink:href="#glyph1-8" x="198.749992" y="7.896162"/>
</g>
<path style="fill:none;stroke-width:1;stroke-linecap:butt;stroke-linejoin:miter;stroke:rgb(0%,0%,0%);stroke-opacity:1;stroke-miterlimit:10;" d="M 201.00167 27.998319 L 201.00167 18.001868 C 201.00167 11.335754 197.665892 7.999976 190.999778 7.999976 L 141.0012 7.999976 C 134.335086 7.999976 130.999308 10.274617 130.999308 14.818459 L 130.999308 21.631499 " transform="matrix(0.717833,0,0,0.717833,0.358916,0.358916)"/>
<path style="fill-rule:nonzero;fill:rgb(0%,0%,0%);fill-opacity:1;stroke-width:1;stroke-linecap:butt;stroke-linejoin:miter;stroke:rgb(0%,0%,0%);stroke-opacity:1;stroke-miterlimit:10;" d="M 130.999308 26.877323 L 127.500278 19.879264 L 130.999308 21.631499 L 134.498337 19.879264 Z M 130.999308 26.877323 " transform="matrix(0.717833,0,0,0.717833,0.358916,0.358916)"/>
<path style=" stroke:none;fill-rule:nonzero;fill:rgb(100%,100%,100%);fill-opacity:1;" d="M 95.472656 0.71875 L 136.386719 0.71875 L 136.386719 10.050781 L 95.472656 10.050781 Z M 95.472656 0.71875 "/>
<g style="fill:rgb(39.219666%,38.819885%,38.819885%);fill-opacity:1;">
  <use xlink:href="#glyph1-1" x="95.527858" y="7.896162"/>
  <use xlink:href="#glyph1-2" x="99.475939" y="7.896162"/>
  <use xlink:href="#glyph1-3" x="103.867408" y="7.896162"/>
  <use xlink:href="#glyph1-4" x="108.258877" y="7.896162"/>
  <use xlink:href="#glyph1-5" x="113.961233" y="7.896162"/>
  <use xlink:href="#glyph1-6" x="115.715507" y="7.896162"/>
  <use xlink:href="#glyph1-1" x="120.106976" y="7.896162"/>
  <use xlink:href="#glyph1-1" x="124.055057" y="7.896162"/>
  <use xlink:href="#glyph1-7" x="128.003138" y="7.896162"/>
  <use xlink:href="#glyph1-8" x="134.145026" y="7.896162"/>
</g>
<path style="fill:none;stroke-width:1;stroke-linecap:butt;stroke-linejoin:miter;stroke:rgb(0%,0%,0%);stroke-opacity:1;stroke-miterlimit:10;" d="M 111.000965 27.998319 L 111.000965 18.001868 C 111.000965 11.335754 107.665187 7.999976 100.999073 7.999976 L 51.000494 7.999976 C 44.33438 7.999976 40.998602 10.274617 40.998602 14.818459 L 40.998602 21.631499 " transform="matrix(0.717833,0,0,0.717833,0.358916,0.358916)"/>
<path style="fill-rule:nonzero;fill:rgb(0%,0%,0%);fill-opacity:1;stroke-width:1;stroke-linecap:butt;stroke-linejoin:miter;stroke:rgb(0%,0%,0%);stroke-opacity:1;stroke-miterlimit:10;" d="M 40.998602 26.877323 L 37.499572 19.879264 L 40.998602 21.631499 L 44.497632 19.879264 Z M 40.998602 26.877323 " transform="matrix(0.717833,0,0,0.717833,0.358916,0.358916)"/>
<path style=" stroke:none;fill-rule:nonzero;fill:rgb(100%,100%,100%);fill-opacity:1;" d="M 30.867188 0.71875 L 71.785156 0.71875 L 71.785156 10.050781 L 30.867188 10.050781 Z M 30.867188 0.71875 "/>
<g style="fill:rgb(39.219666%,38.819885%,38.819885%);fill-opacity:1;">
  <use xlink:href="#glyph1-1" x="30.922896" y="7.896162"/>
  <use xlink:href="#glyph1-2" x="34.870977" y="7.896162"/>
  <use xlink:href="#glyph1-3" x="39.262446" y="7.896162"/>
  <use xlink:href="#glyph1-4" x="43.653915" y="7.896162"/>
  <use xlink:href="#glyph1-5" x="49.35627" y="7.896162"/>
  <use xlink:href="#glyph1-6" x="51.110545" y="7.896162"/>
  <use xlink:href="#glyph1-1" x="55.502014" y="7.896162"/>
  <use xlink:href="#glyph1-1" x="59.450095" y="7.896162"/>
  <use xlink:href="#glyph1-7" x="63.398176" y="7.896162"/>
  <use xlink:href="#glyph1-8" x="69.540063" y="7.896162"/>
</g>
</g>
</svg>
