{
  "port": 3000,
  "logLevel": "info",
  "accessTokenPrivateKey": "ACCESS_TOKEN_PRIVATE_KEY",
  "accessTokenPublicKey": "ACCESS_TOKEN_PUBLIC_KEY",
  "refreshTokenPrivateKey": "REFRESH_PRIVATE_KEY",
  "refreshTokenPublicKey": "REFRESH_PUBLIC_KEY",
  "accessTokenTtl": "15m",
  "refreshTokenTtl": "1y",
  "smtp": {
    "user": "diginervaconsulting@gmail.com",
    "pass": "fuvajvolktpzrsqy",
    "host": "smtp.ethereal.email",
    "port": 587,
    "secure": false
  }
}

