%YAML 1.1
%TAG !u! tag:unity3d.com,2011:
--- !u!74 &7400000
AnimationClip:
  m_ObjectHideFlags: 0
  m_PrefabParentObject: {fileID: 0}
  m_PrefabInternal: {fileID: 0}
  m_Name: WalkInAnim_3
  serializedVersion: 6
  m_Legacy: 0
  m_Compressed: 0
  m_UseHighQualityCurve: 1
  m_RotationCurves: []
  m_CompressedRotationCurves: []
  m_EulerCurves: []
  m_PositionCurves:
  - curve:
      serializedVersion: 2
      m_Curve:
      - time: 0
        value: {x: -1.76, y: 3.491, z: 11.69}
        inSlope: {x: 1.457143, y: -1.6757144, z: -5.9571404}
        outSlope: {x: 1.457143, y: -1.6757144, z: -5.9571404}
        tangentMode: 0
      - time: 0.23333333
        value: {x: -1.42, y: 3.1, z: 10.3}
        inSlope: {x: 1.457143, y: -1.6757144, z: -5.9571404}
        outSlope: {x: 5.269565, y: -0.15652159, z: 0.8347818}
        tangentMode: 0
      - time: 1
        value: {x: 2.62, y: 2.98, z: 10.94}
        inSlope: {x: 5.269565, y: -0.15652159, z: 0.8347818}
        outSlope: {x: 5.269565, y: -0.15652159, z: 0.8347818}
        tangentMode: 0
      m_PreInfinity: 2
      m_PostInfinity: 2
      m_RotationOrder: 4
    path: 
  m_ScaleCurves: []
  m_FloatCurves: []
  m_PPtrCurves: []
  m_SampleRate: 60
  m_WrapMode: 0
  m_Bounds:
    m_Center: {x: 0, y: 0, z: 0}
    m_Extent: {x: 0, y: 0, z: 0}
  m_ClipBindingConstant:
    genericBindings:
    - path: 0
      attribute: 1
      script: {fileID: 0}
      classID: 4
      customType: 0
      isPPtrCurve: 0
    pptrCurveMapping: []
  m_AnimationClipSettings:
    serializedVersion: 2
    m_AdditiveReferencePoseClip: {fileID: 0}
    m_AdditiveReferencePoseTime: 0
    m_StartTime: 0
    m_StopTime: 1
    m_OrientationOffsetY: 0
    m_Level: 0
    m_CycleOffset: 0
    m_HasAdditiveReferencePose: 0
    m_LoopTime: 0
    m_LoopBlend: 0
    m_LoopBlendOrientation: 0
    m_LoopBlendPositionY: 0
    m_LoopBlendPositionXZ: 0
    m_KeepOriginalOrientation: 0
    m_KeepOriginalPositionY: 1
    m_KeepOriginalPositionXZ: 0
    m_HeightFromFeet: 0
    m_Mirror: 0
  m_EditorCurves:
  - curve:
      serializedVersion: 2
      m_Curve:
      - time: 0
        value: -1.76
        inSlope: 1.457143
        outSlope: 1.457143
        tangentMode: 21
      - time: 0.23333333
        value: -1.42
        inSlope: 1.457143
        outSlope: 5.269565
        tangentMode: 21
      - time: 1
        value: 2.62
        inSlope: 5.269565
        outSlope: 5.269565
        tangentMode: 21
      m_PreInfinity: 2
      m_PostInfinity: 2
      m_RotationOrder: 4
    attribute: m_LocalPosition.x
    path: 
    classID: 4
    script: {fileID: 0}
  - curve:
      serializedVersion: 2
      m_Curve:
      - time: 0
        value: 3.491
        inSlope: -1.6757144
        outSlope: -1.6757144
        tangentMode: 21
      - time: 0.23333333
        value: 3.1
        inSlope: -1.6757144
        outSlope: -0.15652159
        tangentMode: 21
      - time: 1
        value: 2.98
        inSlope: -0.15652159
        outSlope: -0.15652159
        tangentMode: 21
      m_PreInfinity: 2
      m_PostInfinity: 2
      m_RotationOrder: 4
    attribute: m_LocalPosition.y
    path: 
    classID: 4
    script: {fileID: 0}
  - curve:
      serializedVersion: 2
      m_Curve:
      - time: 0
        value: 11.69
        inSlope: -5.9571404
        outSlope: -5.9571404
        tangentMode: 21
      - time: 0.23333333
        value: 10.3
        inSlope: -5.9571404
        outSlope: 0.8347818
        tangentMode: 21
      - time: 1
        value: 10.94
        inSlope: 0.8347818
        outSlope: 0.8347818
        tangentMode: 21
      m_PreInfinity: 2
      m_PostInfinity: 2
      m_RotationOrder: 4
    attribute: m_LocalPosition.z
    path: 
    classID: 4
    script: {fileID: 0}
  m_EulerEditorCurves: []
  m_HasGenericRootTransform: 1
  m_HasMotionFloatCurves: 0
  m_GenerateMotionCurves: 0
  m_Events:
  - time: 0
    functionName: AnimFrontRun
    data: 
    objectReferenceParameter: {fileID: 0}
    floatParameter: 0
    intParameter: 0
    messageOptions: 0
  - time: 0.23333333
    functionName: AnimRunRight
    data: 
    objectReferenceParameter: {fileID: 0}
    floatParameter: 0
    intParameter: 0
    messageOptions: 0
  - time: 1
    functionName: DidEnterGame
    data: 
    objectReferenceParameter: {fileID: 0}
    floatParameter: 0
    intParameter: 0
    messageOptions: 0
