%YAML 1.1
%TAG !u! tag:unity3d.com,2011:
--- !u!74 &7400000
AnimationClip:
  m_ObjectHideFlags: 0
  m_PrefabParentObject: {fileID: 0}
  m_PrefabInternal: {fileID: 0}
  m_Name: WalkOutAnim_1
  serializedVersion: 6
  m_Legacy: 0
  m_Compressed: 0
  m_UseHighQualityCurve: 1
  m_RotationCurves: []
  m_CompressedRotationCurves: []
  m_EulerCurves: []
  m_PositionCurves:
  - curve:
      serializedVersion: 2
      m_Curve:
      - time: 0
        value: {x: -6.96, y: -1.03, z: 3.52}
        inSlope: {x: 5.067143, y: 0.17142853, z: 0.35000017}
        outSlope: {x: 5.067143, y: 0.17142853, z: 0.35000017}
        tangentMode: 0
      - time: 1.4
        value: {x: 0.13399982, y: -0.79, z: 4.01}
        inSlope: {x: 7.586072, y: -0.5476191, z: -0.8083334}
        outSlope: {x: 7.586072, y: -0.5476191, z: -0.8083334}
        tangentMode: 0
      - time: 2.6
        value: {x: 12.26, y: -2.31, z: 1.65}
        inSlope: {x: 10.1050005, y: -1.2666668, z: -1.9666669}
        outSlope: {x: 10.1050005, y: -1.2666668, z: -1.9666669}
        tangentMode: 0
      m_PreInfinity: 2
      m_PostInfinity: 2
      m_RotationOrder: 4
    path: 
  m_ScaleCurves: []
  m_FloatCurves: []
  m_PPtrCurves: []
  m_SampleRate: 60
  m_WrapMode: 0
  m_Bounds:
    m_Center: {x: 0, y: 0, z: 0}
    m_Extent: {x: 0, y: 0, z: 0}
  m_ClipBindingConstant:
    genericBindings:
    - path: 0
      attribute: 1
      script: {fileID: 0}
      classID: 4
      customType: 0
      isPPtrCurve: 0
    pptrCurveMapping: []
  m_AnimationClipSettings:
    serializedVersion: 2
    m_AdditiveReferencePoseClip: {fileID: 0}
    m_AdditiveReferencePoseTime: 0
    m_StartTime: 0
    m_StopTime: 2.6
    m_OrientationOffsetY: 0
    m_Level: 0
    m_CycleOffset: 0
    m_HasAdditiveReferencePose: 0
    m_LoopTime: 0
    m_LoopBlend: 0
    m_LoopBlendOrientation: 0
    m_LoopBlendPositionY: 0
    m_LoopBlendPositionXZ: 0
    m_KeepOriginalOrientation: 0
    m_KeepOriginalPositionY: 1
    m_KeepOriginalPositionXZ: 0
    m_HeightFromFeet: 0
    m_Mirror: 0
  m_EditorCurves:
  - curve:
      serializedVersion: 2
      m_Curve:
      - time: 0
        value: -6.96
        inSlope: 5.067143
        outSlope: 5.067143
        tangentMode: 10
      - time: 1.4
        value: 0.13399982
        inSlope: 7.586072
        outSlope: 7.586072
        tangentMode: 10
      - time: 2.6
        value: 12.26
        inSlope: 10.1050005
        outSlope: 10.1050005
        tangentMode: 10
      m_PreInfinity: 2
      m_PostInfinity: 2
      m_RotationOrder: 4
    attribute: m_LocalPosition.x
    path: 
    classID: 4
    script: {fileID: 0}
  - curve:
      serializedVersion: 2
      m_Curve:
      - time: 0
        value: -1.03
        inSlope: 0.17142853
        outSlope: 0.17142853
        tangentMode: 10
      - time: 1.4
        value: -0.79
        inSlope: -0.5476191
        outSlope: -0.5476191
        tangentMode: 10
      - time: 2.6
        value: -2.31
        inSlope: -1.2666668
        outSlope: -1.2666668
        tangentMode: 10
      m_PreInfinity: 2
      m_PostInfinity: 2
      m_RotationOrder: 4
    attribute: m_LocalPosition.y
    path: 
    classID: 4
    script: {fileID: 0}
  - curve:
      serializedVersion: 2
      m_Curve:
      - time: 0
        value: 3.52
        inSlope: 0.35000017
        outSlope: 0.35000017
        tangentMode: 10
      - time: 1.4
        value: 4.01
        inSlope: -0.8083334
        outSlope: -0.8083334
        tangentMode: 10
      - time: 2.6
        value: 1.65
        inSlope: -1.9666669
        outSlope: -1.9666669
        tangentMode: 10
      m_PreInfinity: 2
      m_PostInfinity: 2
      m_RotationOrder: 4
    attribute: m_LocalPosition.z
    path: 
    classID: 4
    script: {fileID: 0}
  m_EulerEditorCurves: []
  m_HasGenericRootTransform: 1
  m_HasMotionFloatCurves: 0
  m_GenerateMotionCurves: 0
  m_Events:
  - time: 0
    functionName: AnimFrontWalkRight
    data: 
    objectReferenceParameter: {fileID: 0}
    floatParameter: 0
    intParameter: 0
    messageOptions: 0
  - time: 2.6
    functionName: DidExitGame
    data: 
    objectReferenceParameter: {fileID: 0}
    floatParameter: 0
    intParameter: 0
    messageOptions: 0
