%YAML 1.1
%TAG !u! tag:unity3d.com,2011:
--- !u!74 &7400000
AnimationClip:
  m_ObjectHideFlags: 0
  m_PrefabParentObject: {fileID: 0}
  m_PrefabInternal: {fileID: 0}
  m_Name: hitByVestAnim
  serializedVersion: 6
  m_Legacy: 0
  m_Compressed: 0
  m_UseHighQualityCurve: 1
  m_RotationCurves: []
  m_CompressedRotationCurves: []
  m_EulerCurves: []
  m_PositionCurves: []
  m_ScaleCurves: []
  m_FloatCurves: []
  m_PPtrCurves:
  - curve:
    - time: 0
      value: {fileID: 21300000, guid: 4f6dfe6c2a0c9b046b5c55e5f2c84f63, type: 3}
    - time: 0.016666668
      value: {fileID: 21300000, guid: d50b84afc2d6f12448fa80fefe36ee63, type: 3}
    - time: 0.033333335
      value: {fileID: 21300000, guid: 4e75d9a1f1518844c8d0f8a433e425a3, type: 3}
    - time: 0.05
      value: {fileID: 21300000, guid: 5ccab622a4f3ef04e9c09ef2f554bedd, type: 3}
    - time: 0.06666667
      value: {fileID: 21300000, guid: 188aa4ce4703d654aa9cfd7171e9c25d, type: 3}
    - time: 0.083333336
      value: {fileID: 21300000, guid: 4c030bf4447c6c04690e9274d16ae8ab, type: 3}
    - time: 0.1
      value: {fileID: 21300000, guid: fe95ebeb56a7dc44ba06f14020aeaaa7, type: 3}
    - time: 0.11666667
      value: {fileID: 21300000, guid: b8d4455404884f1489bd0953bd16833c, type: 3}
    - time: 0.13333334
      value: {fileID: 21300000, guid: 9b60dd2064547d64dbb424f218d908c8, type: 3}
    - time: 0.15
      value: {fileID: 21300000, guid: df6f390d2972e5d4499e9fcfbe35cb7b, type: 3}
    - time: 0.16666667
      value: {fileID: 21300000, guid: 4dd4679fecb4be2428f962d9a8b33edb, type: 3}
    attribute: m_Sprite
    path: 
    classID: 212
    script: {fileID: 0}
  m_SampleRate: 60
  m_WrapMode: 0
  m_Bounds:
    m_Center: {x: 0, y: 0, z: 0}
    m_Extent: {x: 0, y: 0, z: 0}
  m_ClipBindingConstant:
    genericBindings:
    - path: 0
      attribute: 0
      script: {fileID: 0}
      classID: 212
      customType: 23
      isPPtrCurve: 1
    pptrCurveMapping:
    - {fileID: 21300000, guid: 4f6dfe6c2a0c9b046b5c55e5f2c84f63, type: 3}
    - {fileID: 21300000, guid: d50b84afc2d6f12448fa80fefe36ee63, type: 3}
    - {fileID: 21300000, guid: 4e75d9a1f1518844c8d0f8a433e425a3, type: 3}
    - {fileID: 21300000, guid: 5ccab622a4f3ef04e9c09ef2f554bedd, type: 3}
    - {fileID: 21300000, guid: 188aa4ce4703d654aa9cfd7171e9c25d, type: 3}
    - {fileID: 21300000, guid: 4c030bf4447c6c04690e9274d16ae8ab, type: 3}
    - {fileID: 21300000, guid: fe95ebeb56a7dc44ba06f14020aeaaa7, type: 3}
    - {fileID: 21300000, guid: b8d4455404884f1489bd0953bd16833c, type: 3}
    - {fileID: 21300000, guid: 9b60dd2064547d64dbb424f218d908c8, type: 3}
    - {fileID: 21300000, guid: df6f390d2972e5d4499e9fcfbe35cb7b, type: 3}
    - {fileID: 21300000, guid: 4dd4679fecb4be2428f962d9a8b33edb, type: 3}
  m_AnimationClipSettings:
    serializedVersion: 2
    m_AdditiveReferencePoseClip: {fileID: 0}
    m_AdditiveReferencePoseTime: 0
    m_StartTime: 0
    m_StopTime: 0.18333334
    m_OrientationOffsetY: 0
    m_Level: 0
    m_CycleOffset: 0
    m_HasAdditiveReferencePose: 0
    m_LoopTime: 1
    m_LoopBlend: 0
    m_LoopBlendOrientation: 0
    m_LoopBlendPositionY: 0
    m_LoopBlendPositionXZ: 0
    m_KeepOriginalOrientation: 0
    m_KeepOriginalPositionY: 1
    m_KeepOriginalPositionXZ: 0
    m_HeightFromFeet: 0
    m_Mirror: 0
  m_EditorCurves: []
  m_EulerEditorCurves: []
  m_HasGenericRootTransform: 0
  m_HasMotionFloatCurves: 0
  m_GenerateMotionCurves: 0
  m_Events: []
