{
    "name": "E-TABM-1202",
    "description": "This study was performed with an overall aim to compare gene expression prolife in human sarcoma cell lines and in primary untransformed cells. Individual Cell Lines were collected from ATCC, DSMZ, HPA Cultures, Clonetics, Wolfson Insitute for Biomedical Research Cell bank, UCL, London, U.K. or were a gift from other researchers.",
    "total_sample_number": 101,
    "pathologies": [
        {
            "pathology_id": 2,
            "pathology_name": "Rhabdomyosarcoma",
            "pathology_sample_number": 101
        }
    ],
    "clinical_data": [
        {
            "clinical_data_type":"age"
        },
        {
            "clinical_data_type":"sex"
        },
        {
            "clinical_data_type":"histology"
        },
        {
            "clinical_data_type":"IRS_TNM"
        },
        {
            "clinical_data_type":"TNM_M"
        },
        {
            "clinical_data_type":"survival_time"
        },
        {
            "clinical_data_type":"status"
        },
        {
            "clinical_data_type":"Pax3_chromosomal_translocation"
        },
        {
            "clinical_data_type":"Pax7_chromosomal_translocation"
        },
        {
            "clinical_data_type":"Ncoa1_chromosomal_translocation"
        }
    ],
    "omics": [
        {
            "omics_type":"T"
        }
    ],
    "accessions": [
    
        {
            "identifiant":"E-TABM-1202"
        }
    ],
    "fichiers":
    [
        {
            "fichier_id":1,
            "fichier_type": "clinical",
            "fichier_path": "{sFTP_CLB_path}/E-TABM-1202_clinical_data.csv"
        },
        {
            "fichier_id":2,
            "fichier_type": "raw",
            "fichier_path": "https://www.ebi.ac.uk/arrayexpress/files/E-TABM-1202/E-TABM-1202.raw.1.zip"
        },
        {
            "fichier_id":3,
            "fichier_type": "raw",
            "fichier_path": "https://www.ebi.ac.uk/arrayexpress/files/E-TABM-1202/E-TABM-1202.raw.2.zip"
        },
        {
            "fichier_id":4,
            "fichier_type": "raw",
            "fichier_path": "https://www.ebi.ac.uk/arrayexpress/files/E-TABM-1202/E-TABM-1202.raw.3.zip"
        },
        {
            "fichier_id":5,
            "fichier_type": "raw",
            "fichier_path": "https://www.ebi.ac.uk/arrayexpress/files/E-TABM-1202/E-TABM-1202.raw.4.zip"
        },
        {
            "fichier_id":6,
            "fichier_type": "raw",
            "fichier_path": "https://www.ebi.ac.uk/arrayexpress/files/E-TABM-1202/E-TABM-1202.raw.5.zip"
        },
        {
            "fichier_id":7,
            "fichier_type": "raw",
            "fichier_path": "https://www.ebi.ac.uk/arrayexpress/files/E-TABM-1202/E-TABM-1202.raw.6.zip"
        }
    ],
    "publications":[
        {
            "publication_id":1,
            "publication_titre": "PAX3/FOXO1 fusion gene status is the key prognostic molecular marker in rhabdomyosarcoma and significantly improves current risk stratification.",
            "publication_doi": "10.1200/JCO.2011.38.5591",
            "publication_pmid": "22454413",
            "publication_journal": "Journal of clinical oncology : official journal of the American Society of Clinical Oncology",
            "publication_volume": "30",
            "publication_issue": "14",
            "publication_pages": "1670-7",
            "publication_order": "main",
            "publication_authors":
            [
                {
                    "publication_author_id":1,
                    "publication_author_last_name": "Missiaglia",
                    "publication_author_first_name": "E"
                },
                {
                    "publication_author_id":2,
                    "publication_author_last_name": "Williamson",
                    "publication_author_first_name": "D"
                },
                {
                    "publication_author_id":3,
                    "publication_author_last_name": "Chisholm",
                    "publication_author_first_name": "J"
                },
                {
                    "publication_author_id":4,
                    "publication_author_last_name": "Wirapati",
                    "publication_author_first_name": "P"
                },
                {
                    "publication_author_id":5,
                    "publication_author_last_name": "Pierron",
                    "publication_author_first_name": "G"
                },
                {
                    "publication_author_id":6,
                    "publication_author_last_name": "Petel",
                    "publication_author_first_name": "F"
                },
                {
                    "publication_author_id":7,
                    "publication_author_last_name": "Concordet",
                    "publication_author_first_name": "JP"
                },
                {
                    "publication_author_id":8,
                    "publication_author_last_name": "Thway",
                    "publication_author_first_name": "K"
                },
                {
                    "publication_author_id":9,
                    "publication_author_last_name": "Oberlin",
                    "publication_author_first_name": "O"
                },
                {
                    "publication_author_id":10,
                    "publication_author_last_name": "Pritchard-Jones",
                    "publication_author_first_name": "K"
                },
                {
                    "publication_author_id":11,
                    "publication_author_last_name": "Delattre",
                    "publication_author_first_name": "O"
                },
                {
                    "publication_author_id":12,
                    "publication_author_last_name": "Delorenzi",
                    "publication_author_first_name": "M"
                },
                {
                    "publication_author_id":13,
                    "publication_author_last_name": "Shipley",
                    "publication_author_first_name": "J"
                }
            ]
        },
        {
            "publication_id":2,
            "publication_titre": "Integrated transcriptional and competitive endogenous RNA networks are cross-regulated in permissive molecular environments.",
            "publication_doi": "10.1073/pnas.1222509110",
            "publication_pmid": "23536298",
            "publication_journal": "Proceedings of the National Academy of Sciences of the United States of America",
            "publication_volume": "110",
            "publication_issue": "18",
            "publication_pages": "7154-9",
            "publication_order": "other",
            "publication_authors":
            [
                {
                    "publication_author_id":1,
                    "publication_author_last_name": "Ala",
                    "publication_author_first_name": "U"
                },
                {
                    "publication_author_id":2,
                    "publication_author_last_name": "Karreth",
                    "publication_author_first_name": "FA"
                },
                {
                    "publication_author_id":3,
                    "publication_author_last_name": "Bosia",
                    "publication_author_first_name": "C"
                },
                {
                    "publication_author_id":4,
                    "publication_author_last_name": "Pagnani",
                    "publication_author_first_name": "A"
                },
                {
                    "publication_author_id":1,
                    "publication_author_last_name": "Taulli",
                    "publication_author_first_name": "R"
                },
                {
                    "publication_author_id":1,
                    "publication_author_last_name": "L\u00e9opold",
                    "publication_author_first_name": "V"
                },
                {
                    "publication_author_id":5,
                    "publication_author_last_name": "Tay",
                    "publication_author_first_name": "Y"
                },
                {
                    "publication_author_id":6,
                    "publication_author_last_name": "Provero",
                    "publication_author_first_name": "P"
                },
                {
                    "publication_author_id":7,
                    "publication_author_last_name": "Zecchina",
                    "publication_author_first_name": "R"
                },
                {
                    "publication_author_id":8,
                    "publication_author_last_name": "Pandolfi",
                    "publication_author_first_name": "PP"
                }
            ]
        }
    ],
    "sources": [],
    "technologies":[
        {
            "techonology_id": "A-AFFY-44",
            "techonology_label": "Affymetrix GeneChip Human Genome U133 Plus 2.0 [HG-U133_Plus_2]",
            "techonology_organism": "Homo sapiens"
        }
    ],
    "typeAnalyses": [
        {
            "nom":"Microarray"
        }
    ]
}
