{
    "name": "E-MEXP-353",
    "description": "Comparison of Mesenchymal and some possibly neural crest derived neoplasms.",
    "total_sample_number": 96,
    "pathologies": [
        {
            "pathology_id": 1,
            "pathology_name": "Rhabdomyosarcoma",
            "pathology_sample_number": 14
        },
        {
            "pathology_id": 2,
            "pathology_name": "Osteosarcoma",
            "pathology_sample_number": 22
        }
    ],
    "clinical_data": [
        {
            "clinical_data_type":"age"
        },
        {
            "clinical_data_type":"sex"
        }
    ],
    "omics": [
        {
            "omics_type":"T"
        }
    ],
    "accessions": [
        {
            "identifiant":"E-MEXP-353"
        }
    ],
    "fichiers":
    [
        {
            "fichier_id":1,
            "fichier_type": "clinical",
            "fichier_path": "{sFTP_CLB_path}/E-GEOD-66533_clinical_data.csv"
        },
        

        {
            "fichier_id":1,
            "fichier_type": "clinical",
            "fichier_path": "{sFTP_CLB_path}/E-MEXP-353_clinical_data.csv"
        },
        {
            "fichier_id":2,
            "fichier_type": "raw",
            "fichier_path": "https://www.ebi.ac.uk/arrayexpress/files/E-MEXP-353/E-MEXP-353.raw.1.zip"
        },
        {
            "fichier_id":3,
            "fichier_type": "raw",
            "fichier_path": "https://www.ebi.ac.uk/arrayexpress/files/E-MEXP-353/E-MEXP-353.raw.2.zip"
        },
        { 
            "fichier_id":4,
            "fichier_type": "raw",
            "fichier_path": "https://www.ebi.ac.uk/arrayexpress/files/E-MEXP-353/E-MEXP-353.raw.3.zip"
        },
        {
            "fichier_id":5,
            "fichier_type": "processed",
            "fichier_path": "{sFTP_CLB_path}/E-MEXP-353_processed_data.1.zip"
        }
        
    ],
    "publications":[
        {
            "publication_id":1,
            "publication_titre": "A molecular map of mesenchymal tumors.",
            "publication_doi": "10.1186/gb-2005-6-9-r76",
            "publication_pmid": "16168083",
            "publication_journal": "Genome biology",
            "publication_volume": "6",
            "publication_issue": "9",
            "publication_pages": "R76",
            "publication_order": "main",
            "publication_authors":
            [
                {
                    "publication_author_id":1,
                    "publication_author_last_name": "Guiliano",
                    "publication_author_first_name": "D"
                },
                {
                    "publication_author_id":2,
                    "publication_author_last_name": "Presneau",
                    "publication_author_first_name": "N"
                },
                {
                    "publication_author_id":3,
                    "publication_author_last_name": "McLean",
                    "publication_author_first_name": "S"
                },
                {
                    "publication_author_id":4,
                    "publication_author_last_name": "Frow",
                    "publication_author_first_name": "R"
                },
                {
                    "publication_author_id":5,
                    "publication_author_last_name": "Vujovic",
                    "publication_author_first_name": "S"
                },
                {
                    "publication_author_id":6,
                    "publication_author_last_name": "Anderson",
                    "publication_author_first_name": "J"
                },
                {
                    "publication_author_id":7,
                    "publication_author_last_name": "Sebire",
                    "publication_author_first_name": "N"
                },
                {
                    "publication_author_id":8,
                    "publication_author_last_name": "Whelan",
                    "publication_author_first_name": "J"
                },
                {
                    "publication_author_id":9,
                    "publication_author_last_name": "Athanasou",
                    "publication_author_first_name": "N"
                },
                {
                    "publication_author_id":10,
                    "publication_author_last_name": "Flanagan",
                    "publication_author_first_name": "AM"
                },
                {
                    "publication_author_id":11,
                    "publication_author_last_name": "Boshoff",
                    "publication_author_first_name": "C"
                }
            ]
        },
        {
            "publication_id":2,
            "publication_titre": "Integrative analysis of neuroblastoma and pheochromocytoma genomics data.",
            "publication_doi": "10.1186/1755-8794-5-48",
            "publication_pmid": "23106811",
            "publication_journal": "BMC medical genomics",
            "publication_volume": "5",
            "publication_issue": "",
            "publication_pages": "48",
            "publication_order": "other",
            "publication_authors":
            [
                {
                    "publication_author_id":1,
                    "publication_author_last_name": "Szab\u00f3",
                    "publication_author_first_name": "PM"
                },
                {
                    "publication_author_id":2,
                    "publication_author_last_name": "Pint\u00e9r",
                    "publication_author_first_name": "M"
                },
                {
                    "publication_author_id":3,
                    "publication_author_last_name": "Szab\u00f3",
                    "publication_author_first_name": "DR"
                },
                {
                    "publication_author_id":4,
                    "publication_author_last_name": "Zsippai",
                    "publication_author_first_name": "A"
                },
                {
                    "publication_author_id":5,
                    "publication_author_last_name": "Pat\u00f3cs",
                    "publication_author_first_name": "A"
                },
                {
                    "publication_author_id":6,
                    "publication_author_last_name": "Falus",
                    "publication_author_first_name": "A"
                },
                {
                    "publication_author_id":7,
                    "publication_author_last_name": "R\u00e1cz",
                    "publication_author_first_name": "K"
                },
                {
                    "publication_author_id":8,
                    "publication_author_last_name": "Igaz",
                    "publication_author_first_name": "P"
                }
            ]
        }
    ],
    "sources": [],
    "technologies":[
        {
            "techonology_id": "A-AFFY-33",
            "techonology_label": "Affymetrix GeneChip Human Genome HG-U133A [HG-U133A]",
            "techonology_organism": "Homo sapiens"
        }
    ],
    "typeAnalyses": [
        {
            "nom":"Microarray"
        }
    ]
}

 