{
    "name": "E-GEOD-66533",
    "description": "Genome-wide gene expression in 33 fusion-positive and 25 fusion-negative rhabdomyosarcoma cases was studied using GeneChip Human Genome U133 Plus2 (Affymetrix) Fusion-positive versus fusion-negative rhabdomyosarcoma tumors",
    "total_sample_number": 58,
    "pathologies": [
        {
            "pathology_id": 1,
            "pathology_name": "Rhabdomyosarcoma",
            "pathology_sample_number": 58
        }
    ],
    "clinical_data": [
        {
            "clinical_data_type":"organism part"
        },
        {
            "clinical_data_type":"PAX3-FOXO1"
        },
        {
            "clinical_data_type":"PAX7-FOXO1"
        }        
    ],
    "omics": [
        {
            "omics_type":"T"
        }
    ],
    "accessions": [
        {
            "identifiant":"E-GEOD-66533"
        },
        {
            "identifiant":"GSE66533"
        },
        {
            "identifiant":"PRJNA277218"
        }
    ],
    "fichiers":
    [
        {
            "fichier_id":1,
            "fichier_type": "clinical",
            "fichier_path": "{sFTP_CLB_path}/E-GEOD-66533_clinical_data.csv"
        },
        {
            "fichier_id":2,
            "fichier_type": "raw",
            "fichier_path": "https://www.ebi.ac.uk/arrayexpress/files/E-GEOD-66533/E-GEOD-66533.raw.1.zip"
        },
        {
            "fichier_id":3,
            "fichier_type": "raw",
            "fichier_path": "https://www.ebi.ac.uk/arrayexpress/files/E-GEOD-66533/E-GEOD-66533.raw.2.zip"
        },
        {
            "fichier_id":4,
            "fichier_type": "processed",
            "fichier_path": "{sFTP_CLB_path}/E-GEOD-66533_processed_data.1.zip"
        },
        {
            "fichier_id":5,
            "fichier_type": "clinical",
            "fichier_path": "{sFTP_CLB_path}/E-GEOD-66533_clinical_data.csv"
        },
        {
            "fichier_id":6,
            "fichier_type": "raw",
            "fichier_path": "https://ftp.ncbi.nlm.nih.gov/geo/series/5nnn/E-GEOD-66533/suppl/GSE66533_RAW.tar"
        }
        
    ],
    "publications":[
        {           
            "publication_id":1,
            "publication_titre": "Distinct methylation profiles characterize fusion-positive and fusion-negative rhabdomyosarcoma.",
            "publication_doi": "10.1038/modpathol.2015.82",
            "publication_pmid": "26226845",
            "publication_journal": "Modern pathology : an official journal of the United States and Canadian Academy of Pathology, Inc",
            "publication_volume": "28",
            "publication_issue": "9",
            "publication_pages": "1214-24",
            "publication_order": "main",
            "publication_authors":
            [
                {
                    "publication_author_id":1,
                    "publication_author_last_name": "Sun",
                    "publication_author_first_name": "W"
                },
                {
                    "publication_author_id":1,
                    "publication_author_last_name": "Chatterjee",
                    "publication_author_first_name": "B"
                },
                {
                    "publication_author_id":1,
                    "publication_author_last_name": "Wang",
                    "publication_author_first_name": "Y"
                },
                {
                    "publication_author_id":1,
                    "publication_author_last_name": "Stevenson",
                    "publication_author_first_name": "HS"
                },
                {
                    "publication_author_id":1,
                    "publication_author_last_name": "Edelman",
                    "publication_author_first_name": "DC"
                },
                {
                    "publication_author_id":1,
                    "publication_author_last_name": "Meltzer",
                    "publication_author_first_name": "PS"
                },
                {
                    "publication_author_id":1,
                    "publication_author_last_name": "Barr",
                    "publication_author_first_name": "FG"
                }
            ]
        }
    ],
    "sources": [],
    "technologies":[
        {
            "techonology_id": "A-AFFY-44",
            "techonology_label": "Affymetrix GeneChip Human Genome U133 Plus 2.0 [HG-U133_Plus_2]",
            "techonology_organism": "Homo sapiens"
        },
        {
            "techonology_id": "GPL570",
            "techonology_label": "[HG-U133_Plus_2] Affymetrix Human Genome U133 Plus 2.0 Array",
            "techonology_organism": "Homo sapiens"
        }
    ],
    "typeAnalyses": [
        {
            "nom":"Microarray"
        }
    ]
}



 