{
    "name": "E-MTAB-3580",
    "description": "To date, there are no known prognostic markers identified in patients with fusion gene-negative rhabdomyosarcoma. This study validates the 5-gene (MG5) signature as a prognostic marker in patients with fusion negative intermediate-risk rhabdomyosarcoma clearly stratifying this otherwise clinically homogenous population of patients into two risk groups based on outcome. In addition, this analysis was performed using nCounter assay on paraffin embedded tissues and the results were concordant to previously published results using frozen tissues in a different patient cohort. Therefore, this work holds tremendous translational relevance as the MG5 signature can be reliably assessed in readily available paraffin embedded tissues of fusion gene-negative rhabdomyosarcoma patients in prospective clinical trials to stratify them into prognostic risk groups as well as to potentially tailor future therapy based on these risk groups.",
    "total_sample_number": 84,
    "pathologies": [
        {
            "pathology_id": 1,
            "pathology_name": "Rhabdomyosarcoma",
            "pathology_sample_number": 84
        }
    ],
    "clinical_data": [
        {
            "clinical_data_type":"age"
        },
        {
            "clinical_data_type":"sex"
        },
        {
            "clinical_data_type":"histology"
        },
        {
            "clinical_data_type":"IRS"
        }   
        ,
        {
            "clinical_data_type":"TNM_T"
        } 
        ,
        {
            "clinical_data_type":"TNM_N"
        } 
        ,
        {
            "clinical_data_type":"survival_time"
        }         
    ],
    "omics": [
        {
            "omics_type":"T"
        }
    ],
    "accessions": [
        {
            "identifiant":"E-MTAB-3580"
        }
    ],
    "fichiers":
    [
        {
            "fichier_id":1,
            "fichier_type": "clinical",
            "fichier_path": "{sFTP_CLB_path}/E-MTAB-3580_clinical_data.csv"
        },
        {
            "fichier_id":2,
            "fichier_type": "raw",
            "fichier_path": "https://www.ebi.ac.uk/arrayexpress/files/E-MTAB-3580/E-MTAB-3580.raw.1.zip"
        }        
    ],
    "publications":[],
    "sources": [],
    "technologies":[
        {
            "techonology_id": "A-GEOD-16422",
            "techonology_label": "NanoString nCounter Gene Expression",
            "techonology_organism": ""
        },
        {
            "techonology_id": "GPL570",
            "techonology_label": "[HG-U133_Plus_2] Affymetrix Human Genome U133 Plus 2.0 Array",
            "techonology_organism": "Homo sapiens"
        }
    ],
    "typeAnalyses": [
        {
            "nom":"Microarray"
        }
    ]
}



 