{
    "file_id":6,
    "create_at":"2016-02-10",
    "source":"ArrayExpress",
    "data_type":"raw",
    "format":"CEL",
    "size":[],
    "access":{
        "controlled":false,
        "url":"https://www.ebi.ac.uk/arrayexpress/files/E-GEOD-39262/E-GEOD-39262.raw.1.zip/GSM958994_DG_Cal-72_290303.CEL"
    },
    "data_set":{
        "name": "E-GEOD-39262",
        "description": "This study was performed with an overall aim to compare gene expression prolife in human sarcoma cell lines and in primary untransformed cells. Individual Cell Lines were collected from ATCC, DSMZ, HPA Cultures, Clonetics, Wolfson Insitute for Biomedical Research Cell bank, UCL, London, U.K. or were a gift from other researchers.",
        "total_sample_number": 51,
        "accessions": [
            {
                "identifiant":"E-GEOD-39262"
            },
            {
                "identifiant":"GSE39262"
            },
            {
                "identifiant":"PRJNA170430"
            }
        ]
    },
    "analysis":{
        "pathologie":"osteosarcoma",
        "type_analyse":"Microarray",
        "technologie":{
            "techonology_id": "A-AFFY-33",
            "techonology_label": "Affymetrix GeneChip Human Genome HG-U133A [HG-U133A]",
            "techonology_organism": "Homo sapiens"
        },
        "samples":[
            {
                "name":"GSM958994",
                "type_omic":"G",
                "patient":{
                    "Patient_Id":[],
                    "Patient_Gender":{
                        "ValueMeaning":"HL7:M",
                        "LabelValueMeaning": "Male"
                    },
                    "Patient_Ethnicity":{
                        "ValueMeaning":"HL7:2028-9",
                        "LabelValueMeaning": "Asian"
                    },
                    "Patient_LastNewsStatus":{
                        "ValueMeaning":"UMLS:C2584946",
                        "LabelValueMeaning": "Alive"
                    },
                    "Patient_BirthDate":"2016-02-10"
                }
            }
        ],
        "Biomarker":{
            "Biomarker_Code":"OSIRIS:C39-5",
            "Biomarker_Value":"ETV6-NTRK3"
        }

    }
    

}