<svg width="48" height="48" viewBox="0 0 48 48" fill="none" xmlns="http://www.w3.org/2000/svg">
<path fill-rule="evenodd" clip-rule="evenodd" d="M28.0298 0.132141C21.2511 0.963458 15.463 5.68673 13.3156 12.1394C11.6339 17.1926 12.2718 22.7008 15.0565 27.172L15.4859 27.8615L14.0492 29.3001L12.6124 30.7388L12.2995 30.464C11.9371 30.1459 11.6266 30.0472 11.263 30.1344C11.0885 30.1763 9.36544 31.8399 5.9346 35.2788C0.451788 40.7745 0.437718 40.791 0.12799 42.1048C-0.475522 44.6644 1.11449 47.2618 3.65047 47.8595C4.8 48.1304 5.76135 48.015 6.92476 47.4665C7.599 47.1486 7.8304 46.9337 12.4937 42.2945C15.1697 39.6323 17.4807 37.2896 17.6293 37.0885C17.9841 36.6081 17.9727 36.2985 17.5811 35.7857L17.2629 35.3689L18.6971 33.9372L20.1313 32.5057L20.821 32.935C26.015 36.1681 32.6138 36.4776 38.0918 33.745C43.6148 30.99 47.2354 25.7629 47.9101 19.5702C48.1785 17.1069 47.8395 14.3018 46.9803 11.8743C44.1996 4.01875 36.2919 -0.8811 28.0298 0.132141ZM31.8559 1.96535C37.3384 2.56007 42.0751 5.87859 44.498 10.822C46.9885 15.9034 46.5969 21.8831 43.4667 26.5732C39.9436 31.852 33.8183 34.5343 27.6049 33.5192C21.3598 32.4989 16.2677 27.7895 14.724 21.6062C14.397 20.2967 14.2957 19.3977 14.2957 17.8083C14.2957 15.6009 14.621 13.8354 15.3758 11.9473C18.0302 5.30759 24.81 1.20099 31.8559 1.96535ZM28.0633 4.54042C25.3913 5.00798 22.9072 6.31399 20.9447 8.28317C18.9056 10.3292 17.6587 12.7428 17.1922 15.5468C16.956 16.9672 17.0406 19.3593 17.3742 20.6913C17.8638 22.6457 18.5686 24.1351 19.7346 25.6796C21.6184 28.1746 24.1598 29.8297 27.3314 30.6271C28.2832 30.8664 28.4985 30.8853 30.281 30.8876C32.3345 30.8901 32.6621 30.8467 34.257 30.3615C36.3707 29.7185 38.0988 28.6699 39.7112 27.0521C42.3 24.4545 43.6013 21.3166 43.6003 17.6746C43.5998 16.046 43.4218 14.903 42.9475 13.4833C42.252 11.4017 41.2996 9.87031 39.7136 8.28392C37.8298 6.3996 35.6794 5.21597 33.0714 4.62791C32.1175 4.41288 29.0944 4.35999 28.0633 4.54042ZM32.3578 6.41883C37.0871 7.29262 40.6999 10.9246 41.5882 15.6983C41.8216 16.9528 41.7402 19.2221 41.4182 20.4409C40.3237 24.584 37.2391 27.6731 33.1244 28.7466C31.8766 29.0722 29.7868 29.1553 28.4735 28.9315C23.9525 28.1611 20.4028 24.8968 19.2406 20.4409C18.9507 19.3294 18.8452 17.2172 19.0198 16.023C19.6297 11.8533 22.5535 8.29761 26.529 6.89099C28.2356 6.28707 30.6056 6.09511 32.3578 6.41883ZM29.2591 10.2672C28.1433 10.5671 27.0821 11.4489 26.5931 12.4824C26.3157 13.0686 26.1182 14.0565 26.2019 14.4381C26.286 14.8206 26.7484 15.1826 27.1532 15.1826C27.5762 15.1826 28.0298 14.7584 28.0298 14.3628C28.0298 13.489 28.6028 12.5808 29.3833 12.2175C30.8932 11.5146 32.566 12.5802 32.566 14.2448C32.566 15.1661 32.1446 15.8284 31.1997 16.3921C30.7103 16.684 30.0542 17.4431 29.7482 18.0716C29.5084 18.5638 29.4855 18.7095 29.4536 19.9446C29.4152 21.4363 29.4679 21.6204 29.9955 21.8389C30.3771 21.9969 30.8105 21.8741 31.0627 21.5364C31.2216 21.3236 31.2629 21.0869 31.3082 20.1303C31.3753 18.7121 31.4886 18.4909 32.5099 17.7854C34.3945 16.4836 34.9804 14.3829 34.0132 12.3965C33.6951 11.7433 32.8938 10.9155 32.273 10.5989C31.3593 10.1329 30.2234 10.0079 29.2591 10.2672ZM29.711 23.9902C29.4183 24.2829 29.3422 24.7706 29.5335 25.1279C29.686 25.4128 30.1645 25.6168 30.5229 25.5495C31.5545 25.3561 31.3801 23.7161 30.3279 23.7161C30.0742 23.7161 29.914 23.7873 29.711 23.9902ZM17.2744 32.7181L15.9298 34.0773L14.9222 33.0701L13.9147 32.0628L15.2585 30.7168L16.6025 29.3709L17.6108 30.3649L18.6191 31.3588L17.2744 32.7181ZM13.5848 34.4536L15.6001 36.47L11.0077 41.0619C5.83649 46.2326 6.02728 46.0805 4.72045 46.0746C4.09809 46.0719 3.89004 46.0296 3.50105 45.8266C2.48285 45.2954 1.91564 44.3834 1.90982 43.2682C1.90316 41.9858 1.73001 42.203 6.86454 37.0556C9.39837 34.5155 11.4936 32.4372 11.5205 32.4372C11.5474 32.4372 12.4764 33.3446 13.5848 34.4536Z"/>
</svg>
