<svg width="15" height="15" viewBox="0 0 15 15" fill="none" xmlns="http://www.w3.org/2000/svg">
<path d="M1.875 7.5H13.125" stroke="#4B5A73" stroke-width="2" stroke-linecap="round" stroke-linejoin="round"/>
<path d="M1.875 3.75H13.125" stroke="#4B5A73" stroke-width="2" stroke-linecap="round" stroke-linejoin="round"/>
<path d="M1.875 11.25H13.125" stroke="#4B5A73" stroke-width="2" stroke-linecap="round" stroke-linejoin="round"/>
</svg>
