{
    "$schema": "http://json-schema.org/draft-04/schema#",
    "type": "object",
    "description": "Formulário para excluir a coleta de uma amostra.",
    "properties": {
      "numeroAmostra": {
        "type": "string"
      }
    },
    "required": [
      "numeroAmostra"
    ]
}
