{
    "idioma": "pt_BR",
    "codigoErro": 0,
    "mensagem": "OK",
    "resultados": [
        {
            "nome": "-",
            "id": 1935
        },
        {
            "nome": "ABB",
            "id": 1833
        },
        {
            "nome": "ACIMEX",
            "id": 1891
        },
        {
            "nome": "ACIONAMENTO PELETIZADORA 44",
            "id": 1886
        },
        {
            "nome": "ACIONAMENTO PELETIZADORA 53",
            "id": 1885
        },
        {
            "nome": "ACTION",
            "id": 1487
        },
        {
            "nome": "ADDN",
            "id": 1489
        },
        {
            "nome": "ADDN",
            "id": 2083
        },
        {
            "nome": "AEM",
            "id": 2017
        },
        {
            "nome": "AERZEN",
            "id": 1607
        },
        {
            "nome": "AGCO DO BRASILA",
            "id": 1636
        },
        {
            "nome": "AGCO POWER",
            "id": 1829
        },
        {
            "nome": "ZPMC",
            "id": 1556
        }
    ]
}