
{
  "$schema": "http://json-schema.org/draft-04/schema#",
  "type": "object",
  "properties": {
    "idioma": {
      "type": "string",
      "description": "Idioma utilizado no retorno. Vem das configurações do usuário."
    },
    "listaTipoCompartimentos": {
      "type": "array",
      "items": {
        "type": "object",
        "properties": {
          "nome": {
            "type": "string"
          },
          "id": {
            "type": "integer"
          }
        },
        "required": [
          "nome",
          "id"
        ]
      }
    },
    "mensagem": {
      "type": "string",
      "description": "Mensagem do sistema"
    },
    "codigoErro": {
      "type": "integer",
      "description": "Código do erro ocorrido. O campo será 0 no caso de não ocorrerem erros no processamento da requisição."
    }
  },
  "required": [
    "mensagem"
  ]
}
