{
    "$schema": "http://json-schema.org/draft-04/schema#",
    "type": "object",
    "properties": {
      "numeroPagina": {
        "type": "integer",
        "description": "Atributo para indicar página atual da pesquisa paginada."
      },
      "maximoPorPagina": {
        "type": "integer",
        "description": "Atributo para indicar a quantidade de elementos sendo buscados por página."
      },
      "totalPaginas": {
        "type": "integer",
        "description": "Indica a quantidade de páginas que devem ser buscadas para percorrer todos os resultados da consulta."
      },
      "totalRegistros": {
        "type": "integer",
        "description": "Indica a quantidade de registros que satisfazem a busca, desconsiderando paginação"
      },
      "idioma": {
        "type": "string"
      },
      "resultados": {
        "type": "array",
        "items": {
          "type": "object",
          "properties": {
            "id": {
              "type": "integer"
            },
            "nome": {
              "type": "string"
            },
            "ativo": {
              "type": "boolean"
            }
          },
          "required": [
            "id",
            "nome",
            "ativo"
          ]
        }
      },
      "mensagem": {
        "type": "string"
      },
      "codigoErro": {
        "type": "integer",
        "description": "Código do erro ocorrido. O campo será 0 no caso de não ocorrerem erros no processamento da requisição."
      }
    },
    "required": [
      "numeroPagina",
      "maximoPorPagina",
      "totalPaginas",
      "totalRegistros",
      "mensagem",
      "codigoErro"
    ]
  }
  