{
    "$schema": "http://json-schema.org/draft-04/schema#",
    "type": "object",
    "properties": {
        "idEquipamento": {
            "type": "integer",
            "description": "Id do equipamento. Buscar id em API específica."
        },
        "nome": {
            "type": "string"
        },
        "codigoExterno": {
            "type": "string"
        },
        "numeroSerie": {
            "type": "integer"
        },
        "volume": {
            "type": "integer",
            "description": "Volume do compartimento."
        },
        "idTipoCompartimento": {
            "type": "integer",
            "description": "Id do tipo de compartimento. Buscar id na API específica."
        }
    },
    "required": [
        "idEquipamento",
        "nome",
        "idTipoCompartimento"
    ]
  }
  