{
  "products": [
    {
      "sku": "70741",
      "name": "Brackie",
      "image": "brackie.png",
      "quantity": 32,
      "price": {
        "value": 2.10,
        "type": "simple"
      },
      "attributes": {
        "browar": "Lwówek",
        "gatunek": "Bock",
        "słód": "Monachijski|Pilzneński|Karmelowy",
        "chmiel": "Aromatyczny|Goryczkowy",
        "pochodzenie": "Czechy",
        "smaki": "Kawowy|Śliwka"
      }
    },
    {
      "sku": "76438",
      "name": "Eb",
      "image": "eb.png",
      "quantity": 28,
      "price": {
        "value": 2,
        "type": "special"
      },
      "attributes": {
        "browar": "Ciechan",
        "gatunek": "Klasyczny lager",
        "słód": "Monachijski|Karmelowy",
        "chmiel": "Goryczkowy",
        "pochodzenie": "Rumunia",
        "smaki": "Ziołowy|Owoce leśne|Karmel"
      }
    },
    {
      "sku": "69009",
      "name": "karmi",
      "image": "karmi.png",
      "quantity": 93,
      "price": {
        "value": 3.20,
        "type": "simple"
      },
      "attributes": {
        "browar": "Bojanowo",
        "gatunek": "Owocowe",
        "słód": "Karmelowy|Palony|Wiedeński|Prażony",
        "chmiel": "Neutralny",
        "pochodzenie": "Słowacja",
        "smaki": "Owoce leśne|Karmel|Czekolada|Smoła"
      }
    },
    {
      "sku": "31939",
      "name": "kozlak",
      "image": "kozlak.png",
      "quantity": 3,
      "price": {
        "value": 1.74,
        "type": "special"
      },
      "attributes": {
        "browar": "Calsberg",
        "gatunek": "Klasyczny lager",
        "słód": "Karmelowy|Monachijski",
        "chmiel": "Goryczkowy",
        "pochodzenie": "Rumunia",
        "smaki": "Owoce leśne|Ziołowy|Czekolada|Karmel"
      }
    },
    {
      "sku": "54509",
      "name": "Książ",
      "image": "ksiaz.png",
      "quantity": 8,
      "price": {
        "value": 2.99,
        "type": "simple"
      },
      "attributes": {
        "browar": "Kompania Piwowarska",
        "gatunek": "Stout",
        "słód": "Pilzneński|Wiedeński",
        "chmiel": "Goryczkowy|Neutralny",
        "pochodzenie": "Czechy",
        "smaki": "Zbożowy|Gruszka"
      }
    },
    {
      "sku": "76020",
      "name": "Książęce",
      "image": "ksiazece.png",
      "quantity": 78,
      "price": {
        "value": 4.20,
        "type": "simple"
      },
      "attributes": {
        "browar": "Grupa Żywiec",
        "gatunek": "Stout",
        "słód": "Monachijski|Karmelowy",
        "chmiel": "Goryczkowy",
        "pochodzenie": "Słowacja",
        "smaki": "Karmel"
      }
    },
    {
      "sku": "64543",
      "name": "Perła",
      "image": "perla.png",
      "quantity": 65,
      "price": {
        "value": 2.40,
        "type": "simple"
      },
      "attributes": {
        "browar": "Kompania Piwowarska",
        "gatunek": "Ale",
        "słód": "Pilzneński|Monachijski|Karmelowy",
        "chmiel": "Aromatyczny|Goryczkowy|Neutralny",
        "pochodzenie": "Rumunia",
        "smaki": "Czekolada|Karmel|Owoce leśne|Ziołowy|Zbożowy|Kawowy|Śliwka|Gruszka"
      }
    },
    {
      "sku": "37748",
      "name": "Tatra",
      "image": "tatra.png",
      "quantity": 54,
      "price": {
        "value": 1.69,
        "type": "special",
        "old": 2.20
      },
      "attributes": {
        "browar": "Lwówek",
        "gatunek": "Klasyczny lager",
        "słód": "Pilzneński|Monachijski|Karmelowy|Palony|Wiedeński|Prażony",
        "chmiel": "Aromatyczny|Goryczkowy|Neutralny",
        "pochodzenie": "Polska",
        "smaki": "Czekolada|Karmel|Owoce leśne|Ziołowy|Zbożowy|Kawowy|Śliwka|Gruszka"
      }
    },
    {
      "sku": "51971",
      "name": "Tyskie",
      "image": "tyskie.png",
      "quantity": 81,
      "price": {
        "value": 2.39,
        "type": "special",
        "old": 3.12
      },
      "attributes": {
        "browar": "Ciechan",
        "gatunek": "Pszeniczne",
        "słód": "Palony",
        "chmiel": "Monachijski|Karmelowy",
        "pochodzenie": "Polska",
        "smaki": "Owoce leśne|Ziołowy|Smoła"
      }
    },
    {
      "sku": "80180",
      "name": "Żubr",
      "image": "zubr.png",
      "quantity": 33,
      "price": {
        "value": 1.99,
        "type": "simple"
      },
      "attributes": {
        "browar": "Ciechan",
        "gatunek": "Stout",
        "słód": "Palony|Wiedeński|Prażony",
        "chmiel": "Aromatyczny|Goryczkowy",
        "pochodzenie": "Słowacja",
        "smaki": "Karmel|Zbożowy|Śliwka"
      }
    },
    {
      "sku": "29474",
      "name": "Żywiec",
      "image": "zywiec.png",
      "quantity": 44,
      "price": {
        "value": 3,
        "type": "simple"
      },
      "attributes": {
        "browar": "Grupa Żywiec",
        "gatunek": "Stout",
        "słód": "Karmelowy|Palony|Wiedeński|Prażony",
        "chmiel": "Aromatyczny",
        "pochodzenie": "Polska",
        "smaki": "Czekolada"
      }
    },
    {
      "sku": "29474",
      "name": "Żywiec porter",
      "image": "zywiecporter.png",
      "quantity": 44,
      "price": {
        "value": 3.19,
        "type": "simple"
      },
      "attributes": {
        "browar": "Lwówek",
        "gatunek": "Klasyczny lager",
        "słód": "Pilzneński|Bock|Stout",
        "chmiel": "Goryczkowy",
        "pochodzenie": "Polska|Rumunia|Słowacja",
        "smaki": "Czekolada|Karmel|Owoce leśne|Kawowy|Śliwka|Gruszka"
      }
    }
  ]
}
