{
  "contractTerms": {
    "dateConclusion": 1697207996163,
    "typeConclusion": "еБСО",
    "series": "ААА",
    "number": "123123",
    "regionConclusionAgreement": "Рязанская область",
    "salesChannel": "120  Агентские продажи",
    "policyholder": "Салихов Игорь Олегович",
    "insuranceStart": 1697207996163,
    "insuranceEnd": 1697207996163,
    "insurancePremium": 6680
  },
  "policyholder": {
    "driveAuthorized": true,
    "agreeTransfer": true,
    "fullName": "Барбарисов Николай Иванович",
    "gender": "Мужской",
    "citizenship": "Россия",
    "birthDate": 1697207996163,
    "document": "Паспорт РФ",
    "seriesNumber": "4012 123456",
    "issueCountry": "Россия",
    "departmentCode": "777–777",
    "issuedBy": "Отделениеем УФМС г. России по району Ломоносовский проспект",
    "issueDate": 1697207996163,
    "endDate": 1697207996163,
    "phoneNumber": "8 (964) 123-45-67",
    "email": "barbariska@mail.ru",
    "registrationAddress": "Россия, Пермский край, г. Чусовой, ул. Мира  д. 12"


  }
}