ISO-10303-21;
HEADER;
FILE_DESCRIPTION (( 'STEP AP214' ),
    '1' );
FILE_NAME ('User Library-DG308-2.STEP',
    '2020-06-01T02:37:59',
    ( '' ),
    ( '' ),
    'SwSTEP 2.0',
    'SolidWorks 2019',
    '' );
FILE_SCHEMA (( 'AUTOMOTIVE_DESIGN' ));
ENDSEC;

DATA;
#1 = DIRECTION ( 'NONE',  ( 0.0000000000000000000, 0.0000000000000000000, -1.000000000000000000 ) ) ;
#2 = STYLED_ITEM ( 'NONE', ( #281 ), #1135 ) ;
#3 = SURFACE_STYLE_FILL_AREA ( #1038 ) ;
#4 = ADVANCED_FACE ( 'NONE', ( #67, #562, #267 ), #936, .T. ) ;
#5 = ORIENTED_EDGE ( 'NONE', *, *, #27, .F. ) ;
#6 = DIRECTION ( 'NONE',  ( 1.000000000000000000, -6.803692809454639758E-16, -0.0000000000000000000 ) ) ;
#7 = PLANE ( 'NONE',  #18 ) ;
#8 = SURFACE_STYLE_FILL_AREA ( #286 ) ;
#9 = ORIENTED_EDGE ( 'NONE', *, *, #34, .T. ) ;
#10 = LINE ( 'NONE', #782, #699 ) ;
#11 = SURFACE_STYLE_USAGE ( .BOTH. , #680 ) ;
#12 = EDGE_CURVE ( 'NONE', #693, #752, #924, .T. ) ;
#13 = ORIENTED_EDGE ( 'NONE', *, *, #182, .F. ) ;
#14 = CARTESIAN_POINT ( 'NONE',  ( 2.428679705976080072, 3.575285967953119926, 4.000000000000000000 ) ) ;
#15 = PRESENTATION_STYLE_ASSIGNMENT (( #11 ) ) ;
#16 = EDGE_CURVE ( 'NONE', #1039, #543, #164, .T. ) ;
#17 = VECTOR ( 'NONE', #968, 1000.000000000000000 ) ;
#18 = AXIS2_PLACEMENT_3D ( 'NONE', #190, #1134, #412 ) ;
#19 = PLANE ( 'NONE',  #84 ) ;
#20 = AXIS2_PLACEMENT_3D ( 'NONE', #722, #1002, #147 ) ;
#21 = ORIENTED_EDGE ( 'NONE', *, *, #347, .F. ) ;
#22 = CARTESIAN_POINT ( 'NONE',  ( 0.0000000000000000000, 7.826365425634999262, 4.368159053583569928 ) ) ;
#23 = DIRECTION ( 'NONE',  ( 0.0000000000000000000, 0.9546624573639055367, 0.2976904306488689089 ) ) ;
#24 = UNCERTAINTY_MEASURE_WITH_UNIT (LENGTH_MEASURE( 1.000000000000000082E-05 ), #554, 'distance_accuracy_value', 'NONE');
#25 = LINE ( 'NONE', #280, #315 ) ;
#26 = FILL_AREA_STYLE_COLOUR ( '', #279 ) ;
#27 = EDGE_CURVE ( 'NONE', #254, #38, #1081, .T. ) ;
#28 = ORIENTED_EDGE ( 'NONE', *, *, #860, .F. ) ;
#29 = CARTESIAN_POINT ( 'NONE',  ( 4.160000000000000142, -4.000000000000000000, 3.000000000000000000 ) ) ;
#30 = ORIENTED_EDGE ( 'NONE', *, *, #1181, .T. ) ;
#31 = FACE_OUTER_BOUND ( 'NONE', #388, .T. ) ;
#32 = DIRECTION ( 'NONE',  ( 0.0000000000000000000, -1.000000000000000000, 0.0000000000000000000 ) ) ;
#33 = ORIENTED_EDGE ( 'NONE', *, *, #1095, .F. ) ;
#34 = EDGE_CURVE ( 'NONE', #752, #819, #948, .T. ) ;
#35 = FACE_BOUND ( 'NONE', #905, .T. ) ;
#36 = CARTESIAN_POINT ( 'NONE',  ( 1.696789343609300005, 0.4018560262154909912, 0.1499999999999999944 ) ) ;
#37 = DIRECTION ( 'NONE',  ( 0.0000000000000000000, 0.9546624573639055367, 0.2976904306488689089 ) ) ;
#38 = VERTEX_POINT ( 'NONE', #177 ) ;
#39 =( GEOMETRIC_REPRESENTATION_CONTEXT ( 3 ) GLOBAL_UNCERTAINTY_ASSIGNED_CONTEXT ( ( #635 ) ) GLOBAL_UNIT_ASSIGNED_CONTEXT ( ( #244, #426, #1164 ) ) REPRESENTATION_CONTEXT ( 'NONE', 'WORKASPACE' ) );
#40 = LINE ( 'NONE', #416, #1139 ) ;
#41 = STYLED_ITEM ( 'NONE', ( #838 ), #669 ) ;
#42 = ORIENTED_EDGE ( 'NONE', *, *, #826, .F. ) ;
#43 = DIRECTION ( 'NONE',  ( -0.5773502691896252870, -0.5773502691896261751, -0.5773502691896259531 ) ) ;
#44 = DIRECTION ( 'NONE',  ( 0.0000000000000000000, 0.7071067811865480168, -0.7071067811865470176 ) ) ;
#45 = DIRECTION ( 'NONE',  ( 0.0000000000000000000, 0.0000000000000000000, -1.000000000000000000 ) ) ;
#46 = ORIENTED_EDGE ( 'NONE', *, *, #27, .T. ) ;
#47 = CARTESIAN_POINT ( 'NONE',  ( 2.428679705976080072, 3.575285967953119481, 0.2999999999999999334 ) ) ;
#48 = ORIENTED_EDGE ( 'NONE', *, *, #12, .F. ) ;
#49 = CARTESIAN_POINT ( 'NONE',  ( 0.3984424751094020056, 0.4057657039520100040, 0.1499999999999999944 ) ) ;
#50 = SURFACE_SIDE_STYLE ('',( #609 ) ) ;
#51 = ADVANCED_FACE ( 'NONE', ( #472 ), #95, .F. ) ;
#52 = CARTESIAN_POINT ( 'NONE',  ( 1.643701232102960041, 7.826365425634999262, 3.010496517392910132 ) ) ;
#53 = ORIENTED_EDGE ( 'NONE', *, *, #1005, .T. ) ;
#54 = LINE ( 'NONE', #891, #1120 ) ;
#55 = ORIENTED_EDGE ( 'NONE', *, *, #122, .F. ) ;
#56 = DIRECTION ( 'NONE',  ( 0.0000000000000000000, -1.000000000000000000, 0.0000000000000000000 ) ) ;
#57 = EDGE_CURVE ( 'NONE', #38, #254, #1063, .T. ) ;
#58 = ORIENTED_EDGE ( 'NONE', *, *, #1110, .F. ) ;
#59 = CARTESIAN_POINT ( 'NONE',  ( 4.160000000000000142, 0.0000000000000000000, 2.587915056069412412 ) ) ;
#60 = AXIS2_PLACEMENT_3D ( 'NONE', #875, #1128, #121 ) ;
#61 = VECTOR ( 'NONE', #82, 1000.000000000000000 ) ;
#62 = VERTEX_POINT ( 'NONE', #691 ) ;
#63 = PLANE ( 'NONE',  #1011 ) ;
#64 = COLOUR_RGB ( '',0.9960784313725490335, 0.9960784313725490335, 1.000000000000000000 ) ;
#65 = AXIS2_PLACEMENT_3D ( 'NONE', #944, #757, #774 ) ;
#66 = DIRECTION ( 'NONE',  ( 1.000000000000000000, -0.0000000000000000000, 0.0000000000000000000 ) ) ;
#67 = FACE_BOUND ( 'NONE', #761, .T. ) ;
#68 = CARTESIAN_POINT ( 'NONE',  ( 4.171811191128179885, 7.326365425635000150, 3.010496517392910132 ) ) ;
#69 = EDGE_CURVE ( 'NONE', #701, #327, #275, .T. ) ;
#70 = ORIENTED_EDGE ( 'NONE', *, *, #947, .F. ) ;
#71 = LINE ( 'NONE', #258, #462 ) ;
#72 = CARTESIAN_POINT ( 'NONE',  ( 5.025373442975880067, 3.571376290216599969, 0.2999999999999999889 ) ) ;
#73 = SURFACE_SIDE_STYLE ('',( #550 ) ) ;
#74 = EDGE_CURVE ( 'NONE', #961, #1153, #976, .T. ) ;
#75 = EDGE_LOOP ( 'NONE', ( #395, #911, #33, #727 ) ) ;
#76 = DIRECTION ( 'NONE',  ( 0.0000000000000000000, 1.000000000000000000, 0.0000000000000000000 ) ) ;
#77 = DIRECTION ( 'NONE',  ( -0.0000000000000000000, -1.000000000000000000, 0.0000000000000000000 ) ) ;
#78 = CARTESIAN_POINT ( 'NONE',  ( 0.7968849502188030121, 0.5557657039520099707, 0.2999999999999999889 ) ) ;
#79 = ORIENTED_EDGE ( 'NONE', *, *, #1095, .T. ) ;
#80 = CARTESIAN_POINT ( 'NONE',  ( 5.025373442975880067, 3.571376290216599969, 4.000000000000000000 ) ) ;
#81 = VECTOR ( 'NONE', #271, 1000.000000000000000 ) ;
#82 = DIRECTION ( 'NONE',  ( -1.000000000000000000, 0.0000000000000000000, -0.0000000000000000000 ) ) ;
#83 = MECHANICAL_DESIGN_GEOMETRIC_PRESENTATION_REPRESENTATION (  '', ( #338 ), #296 ) ;
#84 = AXIS2_PLACEMENT_3D ( 'NONE', #298, #846, #682 ) ;
#85 = ORIENTED_EDGE ( 'NONE', *, *, #1171, .T. ) ;
#86 = CARTESIAN_POINT ( 'NONE',  ( 0.0000000000000000000, 7.826365425634999262, 1.571680007585130046 ) ) ;
#87 = ORIENTED_EDGE ( 'NONE', *, *, #844, .F. ) ;
#88 =( LENGTH_UNIT ( ) NAMED_UNIT ( * ) SI_UNIT ( .MILLI., .METRE. ) );
#89 = DIRECTION ( 'NONE',  ( 6.803692809454639758E-16, 1.000000000000000000, -0.0000000000000000000 ) ) ;
#90 = EDGE_CURVE ( 'NONE', #1048, #978, #522, .T. ) ;
#91 = CARTESIAN_POINT ( 'NONE',  ( 3.093578687218610401, 3.871376290216600236, 4.242081647190817057E-17 ) ) ;
#92 = EDGE_LOOP ( 'NONE', ( #1188, #85, #633, #1099, #274, #242, #299 ) ) ;
#93 = CARTESIAN_POINT ( 'NONE',  ( 1.643701232102960041, 7.826365425634999262, 3.010496517392910132 ) ) ;
#94 = EDGE_CURVE ( 'NONE', #339, #62, #25, .T. ) ;
#95 = CYLINDRICAL_SURFACE ( 'NONE', #794, 1.036866490221470150 ) ;
#96 = DIRECTION ( 'NONE',  ( -0.0000000000000000000, 1.000000000000000000, -0.0000000000000000000 ) ) ;
#97 = ORIENTED_EDGE ( 'NONE', *, *, #675, .T. ) ;
#98 = CARTESIAN_POINT ( 'NONE',  ( 3.393578687218609780, 0.5518560262154910134, 0.3000000000000000444 ) ) ;
#99 = CARTESIAN_POINT ( 'NONE',  ( 0.4968849502188033562, 0.2557657039520096487, 3.834571685246752338E-18 ) ) ;
#100 = AXIS2_PLACEMENT_3D ( 'NONE', #754, #767, #488 ) ;
#101 = PRESENTATION_LAYER_ASSIGNMENT (  '', '', ( #41 ) ) ;
#102 = ORIENTED_EDGE ( 'NONE', *, *, #821, .T. ) ;
#103 = ADVANCED_FACE ( 'NONE', ( #183 ), #407, .T. ) ;
#104 = CYLINDRICAL_SURFACE ( 'NONE', #955, 1.036866490221470150 ) ;
#105 = FILL_AREA_STYLE ('',( #690 ) ) ;
#106 = DIRECTION ( 'NONE',  ( 0.0000000000000000000, -1.000000000000000000, 0.0000000000000000000 ) ) ;
#107 = ORIENTED_EDGE ( 'NONE', *, *, #768, .T. ) ;
#108 = CARTESIAN_POINT ( 'NONE',  ( 5.025373442975880067, 0.5518560262154910134, 4.000000000000000000 ) ) ;
#109 = ADVANCED_FACE ( 'NONE', ( #881 ), #687, .F. ) ;
#110 = CARTESIAN_POINT ( 'NONE',  ( 1.612782328097440265, 2.065525835952560119, 4.000000000000000000 ) ) ;
#111 = CARTESIAN_POINT ( 'NONE',  ( 1.620000000000000107, -4.000000000000000000, 3.412084943930588032 ) ) ;
#112 = ORIENTED_EDGE ( 'NONE', *, *, #826, .T. ) ;
#113 = CARTESIAN_POINT ( 'NONE',  ( 0.0000000000000000000, 5.029886257090540269, 0.0000000000000000000 ) ) ;
#114 = DIRECTION ( 'NONE',  ( 0.0000000000000000000, 0.0000000000000000000, 1.000000000000000000 ) ) ;
#115 = DIRECTION ( 'NONE',  ( -9.192048136431604985E-17, -1.000000000000000000, 9.192048136431591426E-17 ) ) ;
#116 = VECTOR ( 'NONE', #166, 1000.000000000000000 ) ;
#117 = AXIS2_PLACEMENT_3D ( 'NONE', #162, #362, #1204 ) ;
#118 = ORIENTED_EDGE ( 'NONE', *, *, #953, .T. ) ;
#119 = CARTESIAN_POINT ( 'NONE',  ( 5.799999999999999822, 2.534103773335809162, 6.021990747453619619 ) ) ;
#120 = SURFACE_STYLE_FILL_AREA ( #105 ) ;
#121 = DIRECTION ( 'NONE',  ( 0.0000000000000000000, 0.0000000000000000000, -1.000000000000000000 ) ) ;
#122 = EDGE_CURVE ( 'NONE', #785, #827, #359, .T. ) ;
#123 = APPLICATION_PROTOCOL_DEFINITION ( 'draft international standard', 'automotive_design', 1998, #589 ) ;
#124 = EDGE_LOOP ( 'NONE', ( #765, #781, #720, #746 ) ) ;
#125 = LINE ( 'NONE', #535, #501 ) ;
#126 = DIRECTION ( 'NONE',  ( 0.0000000000000000000, 1.000000000000000000, 0.0000000000000000000 ) ) ;
#127 = CARTESIAN_POINT ( 'NONE',  ( 1.620000000000000107, -4.000000000000000000, 2.587915056069412412 ) ) ;
#128 = ORIENTED_EDGE ( 'NONE', *, *, #34, .F. ) ;
#129 = FACE_BOUND ( 'NONE', #519, .T. ) ;
#130 = EDGE_LOOP ( 'NONE', ( #1172, #1016, #469, #1069, #1140, #392, #262 ) ) ;
#131 = CYLINDRICAL_SURFACE ( 'NONE', #152, 0.4120849439305878104 ) ;
#132 =( NAMED_UNIT ( * ) PLANE_ANGLE_UNIT ( ) SI_UNIT ( $, .RADIAN. ) );
#133 = AXIS2_PLACEMENT_3D ( 'NONE', #569, #665, #850 ) ;
#134 = VERTEX_POINT ( 'NONE', #943 ) ;
#135 = MECHANICAL_DESIGN_GEOMETRIC_PRESENTATION_REPRESENTATION (  '', ( #1082 ), #420 ) ;
#136 = CARTESIAN_POINT ( 'NONE',  ( 4.171811191128179885, 7.326365425635000150, 4.047363007614380059 ) ) ;
#137 = VECTOR ( 'NONE', #223, 1000.000000000000000 ) ;
#138 = EDGE_CURVE ( 'NONE', #165, #1129, #497, .T. ) ;
#139 = CIRCLE ( 'NONE', #1066, 1.036866490221470150 ) ;
#140 = FACE_OUTER_BOUND ( 'NONE', #92, .T. ) ;
#141 = PRESENTATION_STYLE_ASSIGNMENT (( #414 ) ) ;
#142 = VERTEX_POINT ( 'NONE', #91 ) ;
#143 = CARTESIAN_POINT ( 'NONE',  ( 0.0000000000000000000, 7.826365425634999262, 4.368159053583569928 ) ) ;
#144 = PRESENTATION_STYLE_ASSIGNMENT (( #999 ) ) ;
#145 = EDGE_CURVE ( 'NONE', #142, #1148, #764, .T. ) ;
#146 = ORIENTED_EDGE ( 'NONE', *, *, #588, .T. ) ;
#147 = DIRECTION ( 'NONE',  ( 0.0000000000000000000, -0.0000000000000000000, -1.000000000000000000 ) ) ;
#148 = LINE ( 'NONE', #232, #399 ) ;
#149 = EDGE_CURVE ( 'NONE', #712, #1039, #1152, .T. ) ;
#150 = ORIENTED_EDGE ( 'NONE', *, *, #735, .T. ) ;
#151 = CARTESIAN_POINT ( 'NONE',  ( 4.160000000000000142, -4.000000000000000000, 3.412084943930588032 ) ) ;
#152 = AXIS2_PLACEMENT_3D ( 'NONE', #624, #56, #705 ) ;
#153 = PRESENTATION_LAYER_ASSIGNMENT (  '', '', ( #1082 ) ) ;
#154 = VERTEX_POINT ( 'NONE', #603 ) ;
#155 = VECTOR ( 'NONE', #425, 1000.000000000000000 ) ;
#156 = VECTOR ( 'NONE', #429, 1000.000000000000000 ) ;
#157 = FILL_AREA_STYLE ('',( #529 ) ) ;
#158 = EDGE_CURVE ( 'NONE', #134, #446, #590, .T. ) ;
#159 = ORIENTED_EDGE ( 'NONE', *, *, #982, .T. ) ;
#160 = FILL_AREA_STYLE ('',( #1015 ) ) ;
#161 = ORIENTED_EDGE ( 'NONE', *, *, #381, .F. ) ;
#162 = CARTESIAN_POINT ( 'NONE',  ( 1.643701232102950049, 7.326365425634990380, 3.010496517392910132 ) ) ;
#163 = PRESENTATION_STYLE_ASSIGNMENT (( #261 ) ) ;
#164 = LINE ( 'NONE', #555, #1009 ) ;
#165 = VERTEX_POINT ( 'NONE', #127 ) ;
#166 = DIRECTION ( 'NONE',  ( -1.000000000000000000, 0.0000000000000000000, -0.0000000000000000000 ) ) ;
#167 = ORIENTED_EDGE ( 'NONE', *, *, #892, .T. ) ;
#168 = VERTEX_POINT ( 'NONE', #514 ) ;
#169 = MECHANICAL_DESIGN_GEOMETRIC_PRESENTATION_REPRESENTATION (  '', ( #1215 ), #695 ) ;
#170 = CARTESIAN_POINT ( 'NONE',  ( 5.325373442975879890, 3.871376290216600236, 1.987703982890091380E-16 ) ) ;
#171 = EDGE_CURVE ( 'NONE', #827, #785, #656, .T. ) ;
#172 = AXIS2_PLACEMENT_3D ( 'NONE', #398, #779, #1142 ) ;
#173 = PLANE ( 'NONE',  #1154 ) ;
#174 = AXIS2_PLACEMENT_3D ( 'NONE', #672, #208, #283 ) ;
#175 =( GEOMETRIC_REPRESENTATION_CONTEXT ( 3 ) GLOBAL_UNCERTAINTY_ASSIGNED_CONTEXT ( ( #513 ) ) GLOBAL_UNIT_ASSIGNED_CONTEXT ( ( #769, #187, #952 ) ) REPRESENTATION_CONTEXT ( 'NONE', 'WORKASPACE' ) );
#176 = AXIS2_PLACEMENT_3D ( 'NONE', #52, #898, #337 ) ;
#177 = CARTESIAN_POINT ( 'NONE',  ( 1.620000000000000107, 0.0000000000000000000, 3.412084943930588032 ) ) ;
#178 = CARTESIAN_POINT ( 'NONE',  ( 0.0000000000000000000, 0.0000000000000000000, 6.021990747453619619 ) ) ;
#179 = EDGE_LOOP ( 'NONE', ( #791, #571, #834, #831 ) ) ;
#180 = SURFACE_SIDE_STYLE ('',( #1008 ) ) ;
#181 = FILL_AREA_STYLE ('',( #668 ) ) ;
#182 = EDGE_CURVE ( 'NONE', #1018, #800, #272, .T. ) ;
#183 = FACE_OUTER_BOUND ( 'NONE', #650, .T. ) ;
#184 = ORIENTED_EDGE ( 'NONE', *, *, #246, .T. ) ;
#185 = DIRECTION ( 'NONE',  ( 0.0000000000000000000, -1.000000000000000000, 0.0000000000000000000 ) ) ;
#186 = EDGE_CURVE ( 'NONE', #134, #822, #148, .T. ) ;
#187 =( NAMED_UNIT ( * ) PLANE_ANGLE_UNIT ( ) SI_UNIT ( $, .RADIAN. ) );
#188 = ORIENTED_EDGE ( 'NONE', *, *, #751, .T. ) ;
#189 = DIRECTION ( 'NONE',  ( -0.0000000000000000000, -0.0000000000000000000, -1.000000000000000000 ) ) ;
#190 = CARTESIAN_POINT ( 'NONE',  ( 4.209476065097249808, 2.061616158216040162, 4.000000000000000000 ) ) ;
#191 = UNCERTAINTY_MEASURE_WITH_UNIT (LENGTH_MEASURE( 1.000000000000000082E-05 ), #408, 'distance_accuracy_value', 'NONE');
#192 = VECTOR ( 'NONE', #384, 1000.000000000000000 ) ;
#193 = COLOUR_RGB ( '',0.9960784313725490335, 0.9960784313725490335, 1.000000000000000000 ) ;
#194 = VECTOR ( 'NONE', #807, 1000.000000000000000 ) ;
#195 = AXIS2_PLACEMENT_3D ( 'NONE', #1191, #541, #366 ) ;
#196 = FILL_AREA_STYLE_COLOUR ( '', #215 ) ;
#197 = ADVANCED_FACE ( 'NONE', ( #329 ), #903, .T. ) ;
#198 = ORIENTED_EDGE ( 'NONE', *, *, #1189, .F. ) ;
#199 = LINE ( 'NONE', #108, #443 ) ;
#200 =( LENGTH_UNIT ( ) NAMED_UNIT ( * ) SI_UNIT ( .MILLI., .METRE. ) );
#201 =( NAMED_UNIT ( * ) PLANE_ANGLE_UNIT ( ) SI_UNIT ( $, .RADIAN. ) );
#202 = ORIENTED_EDGE ( 'NONE', *, *, #721, .T. ) ;
#203 = CARTESIAN_POINT ( 'NONE',  ( 3.393578687218609780, 0.5518560262154910134, 0.0000000000000000000 ) ) ;
#204 = LINE ( 'NONE', #498, #778 ) ;
#205 = CARTESIAN_POINT ( 'NONE',  ( 3.093578687218610401, 0.0000000000000000000, 0.0000000000000000000 ) ) ;
#206 = CARTESIAN_POINT ( 'NONE',  ( 4.171811191128179885, 7.326365425635000150, 3.010496517392910132 ) ) ;
#207 = ORIENTED_EDGE ( 'NONE', *, *, #517, .F. ) ;
#208 = DIRECTION ( 'NONE',  ( 0.7071067811865480168, -1.299951914052790061E-16, -0.7071067811865470176 ) ) ;
#209 = CARTESIAN_POINT ( 'NONE',  ( 5.325373442975880778, 0.2518560262154910245, 1.897353801849632760E-16 ) ) ;
#210 = ADVANCED_FACE ( 'NONE', ( #1091 ), #803, .T. ) ;
#211 = CARTESIAN_POINT ( 'NONE',  ( 1.643701232102960041, 7.326365425635000150, 3.010496517392910132 ) ) ;
#212 = AXIS2_PLACEMENT_3D ( 'NONE', #211, #756, #1 ) ;
#213 = PRESENTATION_LAYER_ASSIGNMENT (  '', '', ( #338 ) ) ;
#214 = AXIS2_PLACEMENT_3D ( 'NONE', #511, #527, #702 ) ;
#215 = COLOUR_RGB ( '',0.9960784313725490335, 0.9960784313725490335, 1.000000000000000000 ) ;
#216 = EDGE_LOOP ( 'NONE', ( #79, #1071 ) ) ;
#217 = CARTESIAN_POINT ( 'NONE',  ( 4.171811191128179885, 7.826365425634999262, 1.973630027171440204 ) ) ;
#218 = ORIENTED_EDGE ( 'NONE', *, *, #1060, .T. ) ;
#219 = SURFACE_SIDE_STYLE ('',( #322 ) ) ;
#220 = ADVANCED_FACE ( 'NONE', ( #1096 ), #1165, .T. ) ;
#221 = DIRECTION ( 'NONE',  ( -1.000000000000000000, -0.0000000000000000000, -0.0000000000000000000 ) ) ;
#222 = EDGE_LOOP ( 'NONE', ( #9, #287, #926, #920 ) ) ;
#223 = DIRECTION ( 'NONE',  ( -1.000000000000000000, -0.0000000000000000000, -0.0000000000000000000 ) ) ;
#224 = ORIENTED_EDGE ( 'NONE', *, *, #1042, .F. ) ;
#225 = DIRECTION ( 'NONE',  ( 0.0000000000000000000, 0.7071067811865474617, 0.7071067811865474617 ) ) ;
#226 = DIRECTION ( 'NONE',  ( -0.7071067811865470176, 0.0000000000000000000, -0.7071067811865480168 ) ) ;
#227 = CARTESIAN_POINT ( 'NONE',  ( 2.428679705976080072, 3.575285967953119926, 0.0000000000000000000 ) ) ;
#228 = ADVANCED_FACE ( 'NONE', ( #140 ), #1000, .T. ) ;
#229 = EDGE_LOOP ( 'NONE', ( #46, #945 ) ) ;
#230 = FACE_BOUND ( 'NONE', #1097, .T. ) ;
#231 = PRESENTATION_STYLE_ASSIGNMENT (( #704 ) ) ;
#232 = CARTESIAN_POINT ( 'NONE',  ( 3.393578687218609780, 3.571376290216599969, 4.000000000000000000 ) ) ;
#233 = VECTOR ( 'NONE', #521, 1000.000000000000000 ) ;
#234 = ORIENTED_EDGE ( 'NONE', *, *, #711, .F. ) ;
#235 = PRODUCT_RELATED_PRODUCT_CATEGORY ( 'part', '', ( #316 ) ) ;
#236 = STYLED_ITEM ( 'NONE', ( #231 ), #539 ) ;
#237 = PLANE ( 'NONE',  #214 ) ;
#238 = VECTOR ( 'NONE', #946, 1000.000000000000000 ) ;
#239 = SURFACE_SIDE_STYLE ('',( #1083 ) ) ;
#240 = COLOUR_RGB ( '',0.9960784313725490335, 0.9960784313725490335, 1.000000000000000000 ) ;
#241 =( NAMED_UNIT ( * ) PLANE_ANGLE_UNIT ( ) SI_UNIT ( $, .RADIAN. ) );
#242 = ORIENTED_EDGE ( 'NONE', *, *, #1025, .T. ) ;
#243 = DIRECTION ( 'NONE',  ( 0.0000000000000000000, -1.000000000000000000, 0.0000000000000000000 ) ) ;
#244 =( LENGTH_UNIT ( ) NAMED_UNIT ( * ) SI_UNIT ( .MILLI., .METRE. ) );
#245 = UNCERTAINTY_MEASURE_WITH_UNIT (LENGTH_MEASURE( 1.000000000000000082E-05 ), #987, 'distance_accuracy_value', 'NONE');
#246 = EDGE_CURVE ( 'NONE', #693, #430, #798, .T. ) ;
#247 = PRESENTATION_STYLE_ASSIGNMENT (( #1085 ) ) ;
#248 = ORIENTED_EDGE ( 'NONE', *, *, #390, .F. ) ;
#249 = FACE_OUTER_BOUND ( 'NONE', #737, .T. ) ;
#250 = ORIENTED_EDGE ( 'NONE', *, *, #330, .F. ) ;
#251 = FACE_OUTER_BOUND ( 'NONE', #894, .T. ) ;
#252 = DIRECTION ( 'NONE',  ( 0.0000000000000000000, -0.7071067811865470176, -0.7071067811865480168 ) ) ;
#253 = ADVANCED_FACE ( 'NONE', ( #1078 ), #131, .T. ) ;
#254 = VERTEX_POINT ( 'NONE', #897 ) ;
#255 = CARTESIAN_POINT ( 'NONE',  ( 4.160000000000000142, 0.0000000000000000000, 3.412084943930588032 ) ) ;
#256 = VECTOR ( 'NONE', #1030, 1000.000000000000000 ) ;
#257 = ORIENTED_EDGE ( 'NONE', *, *, #551, .F. ) ;
#258 = CARTESIAN_POINT ( 'NONE',  ( 5.325373442975880778, 0.0000000000000000000, 0.0000000000000000000 ) ) ;
#259 = VECTOR ( 'NONE', #1182, 1000.000000000000114 ) ;
#260 = CIRCLE ( 'NONE', #423, 1.036866490221470150 ) ;
#261 = SURFACE_STYLE_USAGE ( .BOTH. , #1023 ) ;
#262 = ORIENTED_EDGE ( 'NONE', *, *, #1060, .F. ) ;
#263 =( LENGTH_UNIT ( ) NAMED_UNIT ( * ) SI_UNIT ( .MILLI., .METRE. ) );
#264 = EDGE_LOOP ( 'NONE', ( #647, #677, #744, #128 ) ) ;
#265 = LINE ( 'NONE', #80, #716 ) ;
#266 = LINE ( 'NONE', #654, #61 ) ;
#267 = FACE_OUTER_BOUND ( 'NONE', #868, .T. ) ;
#268 = DIRECTION ( 'NONE',  ( 0.0000000000000000000, -0.9544799817562733546, 0.2982749812279671953 ) ) ;
#269 = ADVANCED_FACE ( 'NONE', ( #438 ), #815, .F. ) ;
#270 = EDGE_LOOP ( 'NONE', ( #1092, #159, #348, #13 ) ) ;
#271 = DIRECTION ( 'NONE',  ( 1.000000000000000000, 0.0000000000000000000, 0.0000000000000000000 ) ) ;
#272 = LINE ( 'NONE', #657, #256 ) ;
#273 = LINE ( 'NONE', #750, #937 ) ;
#274 = ORIENTED_EDGE ( 'NONE', *, *, #74, .F. ) ;
#275 = CIRCLE ( 'NONE', #755, 1.036866490221470150 ) ;
#276 = LINE ( 'NONE', #1022, #116 ) ;
#277 = VECTOR ( 'NONE', #1003, 1000.000000000000000 ) ;
#278 = AXIS2_PLACEMENT_3D ( 'NONE', #203, #505, #878 ) ;
#279 = COLOUR_RGB ( '',0.1254901960784313708, 0.5372549019607842924, 0.1254901960784313708 ) ;
#280 = CARTESIAN_POINT ( 'NONE',  ( 0.7968849502188040113, 3.575285967953119926, 0.0000000000000000000 ) ) ;
#281 = PRESENTATION_STYLE_ASSIGNMENT (( #1051 ) ) ;
#282 = ORIENTED_EDGE ( 'NONE', *, *, #644, .T. ) ;
#283 = DIRECTION ( 'NONE',  ( -0.7071067811865470176, 0.0000000000000000000, -0.7071067811865480168 ) ) ;
#284 = CARTESIAN_POINT ( 'NONE',  ( 0.0000000000000000000, 0.0000000000000000000, 6.021990747453619619 ) ) ;
#285 = ADVANCED_FACE ( 'NONE', ( #344 ), #629, .T. ) ;
#286 = FILL_AREA_STYLE ('',( #196 ) ) ;
#287 = ORIENTED_EDGE ( 'NONE', *, *, #573, .T. ) ;
#288 = CARTESIAN_POINT ( 'NONE',  ( 0.0000000000000000000, 0.2518560262154910245, 0.0000000000000000000 ) ) ;
#289 = ADVANCED_BREP_SHAPE_REPRESENTATION ( 'User Library-DG308-2', ( #376, #195 ), #916 ) ;
#290 = DIRECTION ( 'NONE',  ( 0.0000000000000000000, -1.000000000000000000, 0.0000000000000000000 ) ) ;
#291 = ADVANCED_FACE ( 'NONE', ( #1010 ), #448, .F. ) ;
#292 = CYLINDRICAL_SURFACE ( 'NONE', #545, 0.4120849439305878104 ) ;
#293 = EDGE_LOOP ( 'NONE', ( #890, #814 ) ) ;
#294 = LINE ( 'NONE', #288, #718 ) ;
#295 = CIRCLE ( 'NONE', #893, 0.4120849439305878104 ) ;
#296 =( GEOMETRIC_REPRESENTATION_CONTEXT ( 3 ) GLOBAL_UNCERTAINTY_ASSIGNED_CONTEXT ( ( #489 ) ) GLOBAL_UNIT_ASSIGNED_CONTEXT ( ( #828, #470, #1195 ) ) REPRESENTATION_CONTEXT ( 'NONE', 'WORKASPACE' ) );
#297 = MECHANICAL_DESIGN_GEOMETRIC_PRESENTATION_REPRESENTATION (  '', ( #41 ), #760 ) ;
#298 = CARTESIAN_POINT ( 'NONE',  ( 4.160000000000000142, -4.000000000000000000, 3.000000000000000000 ) ) ;
#299 = ORIENTED_EDGE ( 'NONE', *, *, #578, .T. ) ;
#300 = LINE ( 'NONE', #396, #817 ) ;
#301 = CARTESIAN_POINT ( 'NONE',  ( 5.025373442975880067, 3.571376290216599969, 4.000000000000000000 ) ) ;
#302 = CARTESIAN_POINT ( 'NONE',  ( 1.620000000000000107, 0.0000000000000000000, 3.000000000000000000 ) ) ;
#303 = ORIENTED_EDGE ( 'NONE', *, *, #323, .T. ) ;
#304 = EDGE_CURVE ( 'NONE', #154, #1183, #833, .T. ) ;
#305 = DIRECTION ( 'NONE',  ( 0.0000000000000000000, 0.0000000000000000000, 1.000000000000000000 ) ) ;
#306 = PLANE ( 'NONE',  #1084 ) ;
#307 = DIRECTION ( 'NONE',  ( 0.0000000000000000000, 0.0000000000000000000, -1.000000000000000000 ) ) ;
#308 =( NAMED_UNIT ( * ) SI_UNIT ( $, .STERADIAN. ) SOLID_ANGLE_UNIT ( ) );
#309 = EDGE_LOOP ( 'NONE', ( #250, #666, #449, #929 ) ) ;
#310 = CARTESIAN_POINT ( 'NONE',  ( 2.428679705976080072, 0.2778828519760049853, 0.3000000000000001554 ) ) ;
#311 = EDGE_CURVE ( 'NONE', #847, #62, #664, .T. ) ;
#312 = ORIENTED_EDGE ( 'NONE', *, *, #551, .T. ) ;
#313 = FACE_OUTER_BOUND ( 'NONE', #536, .T. ) ;
#314 = CARTESIAN_POINT ( 'NONE',  ( 3.393578687218609780, 1.785688145108299985, 0.2999999999999999334 ) ) ;
#315 = VECTOR ( 'NONE', #845, 1000.000000000000000 ) ;
#316 = PRODUCT ( 'User Library-DG308-2', 'User Library-DG308-2', '', ( #923 ) ) ;
#317 = FACE_OUTER_BOUND ( 'NONE', #361, .T. ) ;
#318 = CIRCLE ( 'NONE', #639, 0.4120849439305878104 ) ;
#319 = ORIENTED_EDGE ( 'NONE', *, *, #517, .T. ) ;
#320 = CARTESIAN_POINT ( 'NONE',  ( 5.799999999999999822, 3.475442759505510182, 0.0000000000000000000 ) ) ;
#321 = VERTEX_POINT ( 'NONE', #459 ) ;
#322 = SURFACE_STYLE_FILL_AREA ( #908 ) ;
#323 = EDGE_CURVE ( 'NONE', #770, #486, #364, .T. ) ;
#324 = LINE ( 'NONE', #434, #1178 ) ;
#325 = ORIENTED_EDGE ( 'NONE', *, *, #932, .T. ) ;
#326 = FACE_OUTER_BOUND ( 'NONE', #516, .T. ) ;
#327 = VERTEX_POINT ( 'NONE', #466 ) ;
#328 = LINE ( 'NONE', #447, #896 ) ;
#329 = FACE_OUTER_BOUND ( 'NONE', #452, .T. ) ;
#330 = EDGE_CURVE ( 'NONE', #1058, #546, #295, .T. ) ;
#331 = SURFACE_SIDE_STYLE ('',( #1074 ) ) ;
#332 = VERTEX_POINT ( 'NONE', #454 ) ;
#333 = DIRECTION ( 'NONE',  ( 0.0000000000000000000, 0.0000000000000000000, -1.000000000000000000 ) ) ;
#334 = FILL_AREA_STYLE_COLOUR ( '', #360 ) ;
#335 = CARTESIAN_POINT ( 'NONE',  ( 5.799999999999999822, 3.475442759505510182, 2.898498936299870543 ) ) ;
#336 = AXIS2_PLACEMENT_3D ( 'NONE', #824, #548, #849 ) ;
#337 = DIRECTION ( 'NONE',  ( 0.0000000000000000000, 0.0000000000000000000, -1.000000000000000000 ) ) ;
#338 = STYLED_ITEM ( 'NONE', ( #144 ), #597 ) ;
#339 = VERTEX_POINT ( 'NONE', #829 ) ;
#340 = VECTOR ( 'NONE', #1059, 1000.000000000000000 ) ;
#341 = CARTESIAN_POINT ( 'NONE',  ( 0.0000000000000000000, 5.029886257090540269, 0.6996596599081911227 ) ) ;
#342 = EDGE_LOOP ( 'NONE', ( #491, #625, #118, #1043 ) ) ;
#343 = FACE_OUTER_BOUND ( 'NONE', #841, .T. ) ;
#344 = FACE_OUTER_BOUND ( 'NONE', #599, .T. ) ;
#345 = EDGE_LOOP ( 'NONE', ( #806, #87, #198, #909 ) ) ;
#346 = CARTESIAN_POINT ( 'NONE',  ( 0.0000000000000000000, 2.534103773335808718, 6.021990747453619619 ) ) ;
#347 = EDGE_CURVE ( 'NONE', #1129, #165, #615, .T. ) ;
#348 = ORIENTED_EDGE ( 'NONE', *, *, #440, .T. ) ;
#349 = CARTESIAN_POINT ( 'NONE',  ( 0.0000000000000000000, 0.0000000000000000000, 6.021990747453619619 ) ) ;
#350 = UNCERTAINTY_MEASURE_WITH_UNIT (LENGTH_MEASURE( 1.000000000000000082E-05 ), #263, 'distance_accuracy_value', 'NONE');
#351 = CARTESIAN_POINT ( 'NONE',  ( 5.175373442975880423, 0.2759280131077450071, 0.1499999999999999944 ) ) ;
#352 = DIRECTION ( 'NONE',  ( 0.0000000000000000000, 1.000000000000000000, 0.0000000000000000000 ) ) ;
#353 = DIRECTION ( 'NONE',  ( -0.0000000000000000000, 1.000000000000000000, -0.0000000000000000000 ) ) ;
#354 = ORIENTED_EDGE ( 'NONE', *, *, #1089, .T. ) ;
#355 = CARTESIAN_POINT ( 'NONE',  ( 2.428679705976080072, 0.5557657039520098596, 0.3000000000000000444 ) ) ;
#356 = LINE ( 'NONE', #284, #81 ) ;
#357 = ORIENTED_EDGE ( 'NONE', *, *, #573, .F. ) ;
#358 = PRESENTATION_STYLE_ASSIGNMENT (( #455 ) ) ;
#359 = CIRCLE ( 'NONE', #1196, 1.036866490221470150 ) ;
#360 = COLOUR_RGB ( '',0.9960784313725490335, 0.9960784313725490335, 1.000000000000000000 ) ;
#361 = EDGE_LOOP ( 'NONE', ( #410, #42, #532, #671 ) ) ;
#362 = DIRECTION ( 'NONE',  ( 0.0000000000000000000, 1.000000000000000000, 0.0000000000000000000 ) ) ;
#363 = VECTOR ( 'NONE', #745, 1000.000000000000000 ) ;
#364 = LINE ( 'NONE', #743, #192 ) ;
#365 = EDGE_CURVE ( 'NONE', #543, #321, #356, .T. ) ;
#366 = DIRECTION ( 'NONE',  ( 1.000000000000000000, 0.0000000000000000000, 0.0000000000000000000 ) ) ;
#367 = ORIENTED_EDGE ( 'NONE', *, *, #1171, .F. ) ;
#368 = LINE ( 'NONE', #78, #363 ) ;
#369 = ORIENTED_EDGE ( 'NONE', *, *, #1042, .T. ) ;
#370 = LINE ( 'NONE', #653, #1217 ) ;
#371 = CARTESIAN_POINT ( 'NONE',  ( 0.0000000000000000000, 0.2557657039520099818, 0.0000000000000000000 ) ) ;
#372 = EDGE_CURVE ( 'NONE', #254, #165, #476, .T. ) ;
#373 = DIRECTION ( 'NONE',  ( 0.0000000000000000000, -1.000000000000000000, 0.0000000000000000000 ) ) ;
#374 = DIRECTION ( 'NONE',  ( 0.0000000000000000000, -0.0000000000000000000, -1.000000000000000000 ) ) ;
#375 = ORIENTED_EDGE ( 'NONE', *, *, #1012, .T. ) ;
#376 = MANIFOLD_SOLID_BREP ( '\X2\04220432043504400434043E0435\X0\ \X2\0442
0435043B043E\X0\1', #594 ) ;
#377 = PLANE ( 'NONE',  #100 ) ;
#378 = CARTESIAN_POINT ( 'NONE',  ( 0.7968849502188040113, 3.575285967953119926, 0.0000000000000000000 ) ) ;
#379 = LINE ( 'NONE', #866, #719 ) ;
#380 = ORIENTED_EDGE ( 'NONE', *, *, #138, .F. ) ;
#381 = EDGE_CURVE ( 'NONE', #327, #701, #564, .T. ) ;
#382 = VECTOR ( 'NONE', #115, 1000.000000000000000 ) ;
#383 = VECTOR ( 'NONE', #484, 1000.000000000000000 ) ;
#384 = DIRECTION ( 'NONE',  ( -0.0000000000000000000, -1.000000000000000000, -0.0000000000000000000 ) ) ;
#385 = CIRCLE ( 'NONE', #1200, 0.4120849439305878104 ) ;
#386 = DIRECTION ( 'NONE',  ( -1.378807220464740070E-16, -1.000000000000000000, 0.0000000000000000000 ) ) ;
#387 = CARTESIAN_POINT ( 'NONE',  ( 0.7968849502188034561, 0.5557657039520100817, 4.000000000000000000 ) ) ;
#388 = EDGE_LOOP ( 'NONE', ( #1116, #652, #97, #112 ) ) ;
#389 = DIRECTION ( 'NONE',  ( 0.0000000000000000000, 0.0000000000000000000, -1.000000000000000000 ) ) ;
#390 = EDGE_CURVE ( 'NONE', #619, #142, #266, .T. ) ;
#391 = DIRECTION ( 'NONE',  ( 0.0000000000000000000, 1.000000000000000000, -0.0000000000000000000 ) ) ;
#392 = ORIENTED_EDGE ( 'NONE', *, *, #1089, .F. ) ;
#393 = CARTESIAN_POINT ( 'NONE',  ( 3.393578687218609780, 3.571376290216599969, 0.2999999999999999334 ) ) ;
#394 =( NAMED_UNIT ( * ) SI_UNIT ( $, .STERADIAN. ) SOLID_ANGLE_UNIT ( ) );
#395 = ORIENTED_EDGE ( 'NONE', *, *, #171, .F. ) ;
#396 = CARTESIAN_POINT ( 'NONE',  ( 3.393578687218609335, 0.5518560262154910134, 0.0000000000000000000 ) ) ;
#397 = AXIS2_PLACEMENT_3D ( 'NONE', #302, #507, #574 ) ;
#398 = CARTESIAN_POINT ( 'NONE',  ( 4.171811191128179885, 7.326365425634990380, 3.010496517392910132 ) ) ;
#399 = VECTOR ( 'NONE', #428, 1000.000000000000000 ) ;
#400 = MECHANICAL_DESIGN_GEOMETRIC_PRESENTATION_REPRESENTATION (  '', ( #914 ), #659 ) ;
#401 = AXIS2_PLACEMENT_3D ( 'NONE', #632, #651, #570 ) ;
#402 = EDGE_CURVE ( 'NONE', #486, #601, #1205, .T. ) ;
#403 = CIRCLE ( 'NONE', #525, 1.036866490221470150 ) ;
#404 = VERTEX_POINT ( 'NONE', #748 ) ;
#405 = LINE ( 'NONE', #579, #871 ) ;
#406 = CARTESIAN_POINT ( 'NONE',  ( 1.643701232102960264, 7.826365425634999262, 4.047363007614380059 ) ) ;
#407 = PLANE ( 'NONE',  #133 ) ;
#408 =( LENGTH_UNIT ( ) NAMED_UNIT ( * ) SI_UNIT ( .MILLI., .METRE. ) );
#409 = ADVANCED_FACE ( 'NONE', ( #1028 ), #173, .F. ) ;
#410 = ORIENTED_EDGE ( 'NONE', *, *, #697, .F. ) ;
#411 = CARTESIAN_POINT ( 'NONE',  ( 2.728679705976079894, 3.875285967953120636, -2.304327432810826662E-16 ) ) ;
#412 = DIRECTION ( 'NONE',  ( 1.000000000000000000, 0.0000000000000000000, -0.0000000000000000000 ) ) ;
#413 = DIRECTION ( 'NONE',  ( 0.0000000000000000000, 0.0000000000000000000, -1.000000000000000000 ) ) ;
#414 = SURFACE_STYLE_USAGE ( .BOTH. , #331 ) ;
#415 = ORIENTED_EDGE ( 'NONE', *, *, #450, .T. ) ;
#416 = CARTESIAN_POINT ( 'NONE',  ( 4.171811191128179885, 7.826365425634999262, 4.047363007614380059 ) ) ;
#417 = ADVANCED_FACE ( 'NONE', ( #843 ), #377, .F. ) ;
#418 = DIRECTION ( 'NONE',  ( 0.0000000000000000000, 0.0000000000000000000, -1.000000000000000000 ) ) ;
#419 = VECTOR ( 'NONE', #1109, 1000.000000000000000 ) ;
#420 =( GEOMETRIC_REPRESENTATION_CONTEXT ( 3 ) GLOBAL_UNCERTAINTY_ASSIGNED_CONTEXT ( ( #980 ) ) GLOBAL_UNIT_ASSIGNED_CONTEXT ( ( #200, #772, #974 ) ) REPRESENTATION_CONTEXT ( 'NONE', 'WORKASPACE' ) );
#421 = CARTESIAN_POINT ( 'NONE',  ( 3.093578687218610401, 0.2518560262154909690, 7.701960842156888124E-17 ) ) ;
#422 = VECTOR ( 'NONE', #1187, 1000.000000000000000 ) ;
#423 = AXIS2_PLACEMENT_3D ( 'NONE', #206, #96, #1211 ) ;
#424 = ORIENTED_EDGE ( 'NONE', *, *, #675, .F. ) ;
#425 = DIRECTION ( 'NONE',  ( 0.0000000000000000000, -0.9544799817562733546, 0.2982749812279670842 ) ) ;
#426 =( NAMED_UNIT ( * ) PLANE_ANGLE_UNIT ( ) SI_UNIT ( $, .RADIAN. ) );
#427 = ADVANCED_FACE ( 'NONE', ( #313 ), #306, .F. ) ;
#428 = DIRECTION ( 'NONE',  ( 1.838409627286330118E-16, 1.000000000000000000, -0.0000000000000000000 ) ) ;
#429 = DIRECTION ( 'NONE',  ( -0.0000000000000000000, -0.0000000000000000000, 1.000000000000000000 ) ) ;
#430 = VERTEX_POINT ( 'NONE', #301 ) ;
#431 = DIRECTION ( 'NONE',  ( -0.5773502691896253980, 0.5773502691896256200, 0.5773502691896261751 ) ) ;
#432 = ORIENTED_EDGE ( 'NONE', *, *, #479, .F. ) ;
#433 = LINE ( 'NONE', #887, #277 ) ;
#434 = CARTESIAN_POINT ( 'NONE',  ( 5.799999999999999822, 3.475442759505510182, 6.021990747453619619 ) ) ;
#435 = ORIENTED_EDGE ( 'NONE', *, *, #1150, .F. ) ;
#436 = LINE ( 'NONE', #694, #797 ) ;
#437 = ORIENTED_EDGE ( 'NONE', *, *, #171, .T. ) ;
#438 = FACE_OUTER_BOUND ( 'NONE', #1206, .T. ) ;
#439 = VECTOR ( 'NONE', #1067, 1000.000000000000000 ) ;
#440 = EDGE_CURVE ( 'NONE', #877, #800, #872, .T. ) ;
#441 = AXIS2_PLACEMENT_3D ( 'NONE', #36, #528, #1077 ) ;
#442 = ORIENTED_EDGE ( 'NONE', *, *, #90, .F. ) ;
#443 = VECTOR ( 'NONE', #492, 1000.000000000000000 ) ;
#444 = CARTESIAN_POINT ( 'NONE',  ( 5.799999999999999822, 5.029886257090540269, 0.6996596599081911227 ) ) ;
#445 = STYLED_ITEM ( 'NONE', ( #358 ), #1104 ) ;
#446 = VERTEX_POINT ( 'NONE', #1131 ) ;
#447 = CARTESIAN_POINT ( 'NONE',  ( 3.393578687218609780, 0.5518560262154910134, 0.2999999999999999334 ) ) ;
#448 = CYLINDRICAL_SURFACE ( 'NONE', #336, 1.036866490221470150 ) ;
#449 = ORIENTED_EDGE ( 'NONE', *, *, #533, .T. ) ;
#450 = EDGE_CURVE ( 'NONE', #327, #1048, #673, .T. ) ;
#451 = CARTESIAN_POINT ( 'NONE',  ( 2.428679705976080072, 3.575285967953119926, 4.000000000000000000 ) ) ;
#452 = EDGE_LOOP ( 'NONE', ( #468, #741, #167, #456 ) ) ;
#453 = CARTESIAN_POINT ( 'NONE',  ( 4.160000000000000142, 0.0000000000000000000, 3.412084943930588032 ) ) ;
#454 = CARTESIAN_POINT ( 'NONE',  ( 5.025373442975880955, 0.5518560262154907914, 0.2999999999999999889 ) ) ;
#455 = SURFACE_STYLE_USAGE ( .BOTH. , #73 ) ;
#456 = ORIENTED_EDGE ( 'NONE', *, *, #975, .F. ) ;
#457 = CARTESIAN_POINT ( 'NONE',  ( 0.6468849502188029899, 1.787642983976559963, 0.1499999999999999944 ) ) ;
#458 = ADVANCED_FACE ( 'NONE', ( #506 ), #880, .F. ) ;
#459 = CARTESIAN_POINT ( 'NONE',  ( 5.799999999999999822, 0.0000000000000000000, 6.021990747453619619 ) ) ;
#460 = CARTESIAN_POINT ( 'NONE',  ( 4.160000000000000142, 0.0000000000000000000, 3.000000000000000000 ) ) ;
#461 = PRESENTATION_LAYER_ASSIGNMENT (  '', '', ( #1215 ) ) ;
#462 = VECTOR ( 'NONE', #76, 1000.000000000000000 ) ;
#463 = ORIENTED_EDGE ( 'NONE', *, *, #402, .T. ) ;
#464 = DIRECTION ( 'NONE',  ( 1.000000000000000000, -0.0000000000000000000, 0.0000000000000000000 ) ) ;
#465 = VECTOR ( 'NONE', #503, 1000.000000000000000 ) ;
#466 = CARTESIAN_POINT ( 'NONE',  ( 1.643701232102960264, 7.826365425634999262, 4.047363007614380059 ) ) ;
#467 = EDGE_CURVE ( 'NONE', #701, #978, #1045, .T. ) ;
#468 = ORIENTED_EDGE ( 'NONE', *, *, #628, .F. ) ;
#469 = ORIENTED_EDGE ( 'NONE', *, *, #1036, .F. ) ;
#470 =( NAMED_UNIT ( * ) PLANE_ANGLE_UNIT ( ) SI_UNIT ( $, .RADIAN. ) );
#471 = DIRECTION ( 'NONE',  ( -1.000000000000000000, 6.803692809454639758E-16, 0.0000000000000000000 ) ) ;
#472 = FACE_OUTER_BOUND ( 'NONE', #75, .T. ) ;
#473 = FACE_OUTER_BOUND ( 'NONE', #1192, .T. ) ;
#474 = EDGE_LOOP ( 'NONE', ( #586, #863, #1064, #442 ) ) ;
#475 = CARTESIAN_POINT ( 'NONE',  ( 2.728679705976080339, 0.2557657039520098707, 4.276816858437521367E-17 ) ) ;
#476 = LINE ( 'NONE', #1101, #934 ) ;
#477 = DIRECTION ( 'NONE',  ( 0.0000000000000000000, -1.000000000000000000, 0.0000000000000000000 ) ) ;
#478 = SURFACE_STYLE_USAGE ( .BOTH. , #585 ) ;
#479 = EDGE_CURVE ( 'NONE', #1106, #332, #861, .T. ) ;
#480 = ORIENTED_EDGE ( 'NONE', *, *, #304, .F. ) ;
#481 = AXIS2_PLACEMENT_3D ( 'NONE', #335, #66, #418 ) ;
#482 = DIRECTION ( 'NONE',  ( -0.5773502691896255090, -0.5773502691896261751, -0.5773502691896255090 ) ) ;
#483 = CIRCLE ( 'NONE', #869, 0.4120849439305878104 ) ;
#484 = DIRECTION ( 'NONE',  ( -0.5773502691896259531, 0.5773502691896260641, 0.5773502691896252870 ) ) ;
#485 = AXIS2_PLACEMENT_3D ( 'NONE', #997, #333, #1155 ) ;
#486 = VERTEX_POINT ( 'NONE', #99 ) ;
#487 = PLANE ( 'NONE',  #278 ) ;
#488 = DIRECTION ( 'NONE',  ( 0.0000000000000000000, 0.0000000000000000000, -1.000000000000000000 ) ) ;
#489 = UNCERTAINTY_MEASURE_WITH_UNIT (LENGTH_MEASURE( 1.000000000000000082E-05 ), #828, 'distance_accuracy_value', 'NONE');
#490 = DIRECTION ( 'NONE',  ( 0.0000000000000000000, 0.0000000000000000000, -1.000000000000000000 ) ) ;
#491 = ORIENTED_EDGE ( 'NONE', *, *, #1053, .F. ) ;
#492 = DIRECTION ( 'NONE',  ( 0.0000000000000000000, -1.000000000000000000, -0.0000000000000000000 ) ) ;
#493 = CARTESIAN_POINT ( 'NONE',  ( 5.025373442975880067, 3.571376290216599969, 0.0000000000000000000 ) ) ;
#494 = ADVANCED_FACE ( 'NONE', ( #31 ), #7, .F. ) ;
#495 = ORIENTED_EDGE ( 'NONE', *, *, #1005, .F. ) ;
#496 = FACE_OUTER_BOUND ( 'NONE', #342, .T. ) ;
#497 = CIRCLE ( 'NONE', #776, 0.4120849439305878104 ) ;
#498 = CARTESIAN_POINT ( 'NONE',  ( 2.728679705976079894, 0.0000000000000000000, 0.0000000000000000000 ) ) ;
#499 = AXIS2_PLACEMENT_3D ( 'NONE', #457, #567, #848 ) ;
#500 = EDGE_CURVE ( 'NONE', #819, #332, #959, .T. ) ;
#501 = VECTOR ( 'NONE', #713, 1000.000000000000000 ) ;
#502 = DIRECTION ( 'NONE',  ( -1.000000000000000000, 1.378807220464740070E-16, 0.0000000000000000000 ) ) ;
#503 = DIRECTION ( 'NONE',  ( 0.5773502691896251759, -0.5773502691896260641, 0.5773502691896260641 ) ) ;
#504 = EDGE_LOOP ( 'NONE', ( #150, #733, #907, #1094 ) ) ;
#505 = DIRECTION ( 'NONE',  ( -1.700923202363659940E-16, -1.000000000000000000, 0.0000000000000000000 ) ) ;
#506 = FACE_OUTER_BOUND ( 'NONE', #558, .T. ) ;
#507 = DIRECTION ( 'NONE',  ( -0.0000000000000000000, 1.000000000000000000, -0.0000000000000000000 ) ) ;
#508 = DIRECTION ( 'NONE',  ( 0.0000000000000000000, 0.0000000000000000000, 1.000000000000000000 ) ) ;
#509 = ADVANCED_FACE ( 'NONE', ( #788 ), #963, .T. ) ;
#510 = ORIENTED_EDGE ( 'NONE', *, *, #942, .F. ) ;
#511 = CARTESIAN_POINT ( 'NONE',  ( 3.393578687218609780, 3.571376290216599969, 0.0000000000000000000 ) ) ;
#512 = LINE ( 'NONE', #724, #954 ) ;
#513 = UNCERTAINTY_MEASURE_WITH_UNIT (LENGTH_MEASURE( 1.000000000000000082E-05 ), #769, 'distance_accuracy_value', 'NONE');
#514 = CARTESIAN_POINT ( 'NONE',  ( 0.0000000000000000000, 7.826365425634999262, 4.368159053583569928 ) ) ;
#515 = CARTESIAN_POINT ( 'NONE',  ( 3.093578687218610401, 3.871376290216600236, -2.188225125863397070E-16 ) ) ;
#516 = EDGE_LOOP ( 'NONE', ( #622, #1175, #218, #480 ) ) ;
#517 = EDGE_CURVE ( 'NONE', #601, #886, #204, .T. ) ;
#518 = FACE_BOUND ( 'NONE', #229, .T. ) ;
#519 = EDGE_LOOP ( 'NONE', ( #1180, #1194 ) ) ;
#520 = CARTESIAN_POINT ( 'NONE',  ( 4.160000000000000142, 0.0000000000000000000, 2.587915056069412412 ) ) ;
#521 = DIRECTION ( 'NONE',  ( -0.0000000000000000000, -0.0000000000000000000, 1.000000000000000000 ) ) ;
#522 = CIRCLE ( 'NONE', #212, 1.036866490221470150 ) ;
#523 = FILL_AREA_STYLE ('',( #26 ) ) ;
#524 = VECTOR ( 'NONE', #189, 1000.000000000000000 ) ;
#525 = AXIS2_PLACEMENT_3D ( 'NONE', #68, #353, #1098 ) ;
#526 = ORIENTED_EDGE ( 'NONE', *, *, #372, .T. ) ;
#527 = DIRECTION ( 'NONE',  ( -1.000000000000000000, 1.838409627286330118E-16, 0.0000000000000000000 ) ) ;
#528 = DIRECTION ( 'NONE',  ( 1.202734330668879482E-16, 0.7071067811865475727, -0.7071067811865475727 ) ) ;
#529 = FILL_AREA_STYLE_COLOUR ( '', #1119 ) ;
#530 = VERTEX_POINT ( 'NONE', #895 ) ;
#531 = DIRECTION ( 'NONE',  ( 1.378807220464740070E-16, 1.000000000000000000, -0.0000000000000000000 ) ) ;
#532 = ORIENTED_EDGE ( 'NONE', *, *, #246, .F. ) ;
#533 = EDGE_CURVE ( 'NONE', #1087, #1144, #483, .T. ) ;
#534 = ORIENTED_EDGE ( 'NONE', *, *, #94, .T. ) ;
#535 = CARTESIAN_POINT ( 'NONE',  ( 5.025373442975880067, 0.2759280131077450071, 0.2999999999999998224 ) ) ;
#536 = EDGE_LOOP ( 'NONE', ( #989, #1024, #723, #983 ) ) ;
#537 = CARTESIAN_POINT ( 'NONE',  ( 4.160000000000000142, -4.000000000000000000, 3.000000000000000000 ) ) ;
#538 = CARTESIAN_POINT ( 'NONE',  ( 2.512686721487940034, 3.721376290216599880, 0.1499999999999999944 ) ) ;
#539 = ADVANCED_FACE ( 'NONE', ( #802 ), #63, .F. ) ;
#540 = AXIS2_PLACEMENT_3D ( 'NONE', #1160, #994, #37 ) ;
#541 = DIRECTION ( 'NONE',  ( 0.0000000000000000000, 0.0000000000000000000, 1.000000000000000000 ) ) ;
#542 = PRESENTATION_LAYER_ASSIGNMENT (  '', '', ( #236 ) ) ;
#543 = VERTEX_POINT ( 'NONE', #349 ) ;
#544 = LINE ( 'NONE', #1107, #618 ) ;
#545 = AXIS2_PLACEMENT_3D ( 'NONE', #676, #106, #490 ) ;
#546 = VERTEX_POINT ( 'NONE', #520 ) ;
#547 =( NAMED_UNIT ( * ) PLANE_ANGLE_UNIT ( ) SI_UNIT ( $, .RADIAN. ) );
#548 = DIRECTION ( 'NONE',  ( 0.0000000000000000000, -1.000000000000000000, 0.0000000000000000000 ) ) ;
#549 = DIRECTION ( 'NONE',  ( 0.0000000000000000000, -0.0000000000000000000, 1.000000000000000000 ) ) ;
#550 = SURFACE_STYLE_FILL_AREA ( #160 ) ;
#551 = EDGE_CURVE ( 'NONE', #837, #1153, #512, .T. ) ;
#552 = EDGE_LOOP ( 'NONE', ( #30, #234, #534, #775 ) ) ;
#553 = LINE ( 'NONE', #453, #238 ) ;
#554 =( LENGTH_UNIT ( ) NAMED_UNIT ( * ) SI_UNIT ( .MILLI., .METRE. ) );
#555 = CARTESIAN_POINT ( 'NONE',  ( 0.0000000000000000000, 2.534103773335810050, 6.021990747453619619 ) ) ;
#556 = LINE ( 'NONE', #86, #422 ) ;
#557 = ADVANCED_FACE ( 'NONE', ( #343 ), #728, .T. ) ;
#558 = EDGE_LOOP ( 'NONE', ( #184, #424, #188, #48 ) ) ;
#559 = FACE_OUTER_BOUND ( 'NONE', #293, .T. ) ;
#560 =( NAMED_UNIT ( * ) PLANE_ANGLE_UNIT ( ) SI_UNIT ( $, .RADIAN. ) );
#561 = VECTOR ( 'NONE', #1121, 1000.000000000000000 ) ;
#562 = FACE_BOUND ( 'NONE', #970, .T. ) ;
#563 =( NAMED_UNIT ( * ) PLANE_ANGLE_UNIT ( ) SI_UNIT ( $, .RADIAN. ) );
#564 = CIRCLE ( 'NONE', #816, 1.036866490221470150 ) ;
#565 = COLOUR_RGB ( '',0.9960784313725490335, 0.9960784313725490335, 1.000000000000000000 ) ;
#566 = ORIENTED_EDGE ( 'NONE', *, *, #12, .T. ) ;
#567 = DIRECTION ( 'NONE',  ( 0.7071067811865475727, -9.749639355395943947E-17, -0.7071067811865475727 ) ) ;
#568 = DIRECTION ( 'NONE',  ( 1.000000000000000000, -0.0000000000000000000, 0.0000000000000000000 ) ) ;
#569 = CARTESIAN_POINT ( 'NONE',  ( 0.0000000000000000000, 5.029886257090540269, 0.0000000000000000000 ) ) ;
#570 = DIRECTION ( 'NONE',  ( 0.0000000000000000000, 0.7071067811865480168, -0.7071067811865470176 ) ) ;
#571 = ORIENTED_EDGE ( 'NONE', *, *, #1143, .F. ) ;
#572 = CARTESIAN_POINT ( 'NONE',  ( 4.160000000000000142, 0.0000000000000000000, 3.000000000000000000 ) ) ;
#573 = EDGE_CURVE ( 'NONE', #819, #1148, #328, .T. ) ;
#574 = DIRECTION ( 'NONE',  ( 0.0000000000000000000, 0.0000000000000000000, -1.000000000000000000 ) ) ;
#575 = FACE_OUTER_BOUND ( 'NONE', #309, .T. ) ;
#576 = ORIENTED_EDGE ( 'NONE', *, *, #902, .T. ) ;
#577 = DIRECTION ( 'NONE',  ( -0.0000000000000000000, 0.0000000000000000000, 1.000000000000000000 ) ) ;
#578 = EDGE_CURVE ( 'NONE', #1018, #530, #433, .T. ) ;
#579 = CARTESIAN_POINT ( 'NONE',  ( 1.612782328097440265, 0.5557657039520100817, 4.000000000000000000 ) ) ;
#580 = DIRECTION ( 'NONE',  ( 0.0000000000000000000, 0.0000000000000000000, 1.000000000000000000 ) ) ;
#581 = PRESENTATION_LAYER_ASSIGNMENT (  '', '', ( #1031 ) ) ;
#582 = ORIENTED_EDGE ( 'NONE', *, *, #145, .T. ) ;
#583 = ADVANCED_FACE ( 'NONE', ( #986 ), #602, .T. ) ;
#584 = LINE ( 'NONE', #14, #1177 ) ;
#585 = SURFACE_SIDE_STYLE ('',( #3 ) ) ;
#586 = ORIENTED_EDGE ( 'NONE', *, *, #450, .F. ) ;
#587 = DIRECTION ( 'NONE',  ( 1.000000000000000000, 0.0000000000000000000, 0.0000000000000000000 ) ) ;
#588 = EDGE_CURVE ( 'NONE', #770, #62, #795, .T. ) ;
#589 = APPLICATION_CONTEXT ( 'automotive_design' ) ;
#590 = LINE ( 'NONE', #981, #17 ) ;
#591 = LINE ( 'NONE', #515, #465 ) ;
#592 = ORIENTED_EDGE ( 'NONE', *, *, #372, .F. ) ;
#593 = CARTESIAN_POINT ( 'NONE',  ( 4.171811191128179885, 7.326365425635000150, 1.973630027171440204 ) ) ;
#594 = CLOSED_SHELL ( 'NONE', ( #291, #51, #1135, #1104, #228, #804, #840, #4, #210, #883, #876, #417, #1159, #773, #103, #621, #1073, #220, #557, #729, #285, #197, #583, #597, #253, #669, #509, #109, #990, #917, #1212, #1126, #539, #409, #427, #269, #458, #494, #786 ) ) ;
#595 = PRESENTATION_LAYER_ASSIGNMENT (  '', '', ( #914 ) ) ;
#596 = DIRECTION ( 'NONE',  ( 0.0000000000000000000, 0.0000000000000000000, -1.000000000000000000 ) ) ;
#597 = ADVANCED_FACE ( 'NONE', ( #1157 ), #1168, .T. ) ;
#598 = MECHANICAL_DESIGN_GEOMETRIC_PRESENTATION_REPRESENTATION (  '', ( #857 ), #799 ) ;
#599 = EDGE_LOOP ( 'NONE', ( #566, #435, #248, #1033 ) ) ;
#600 = CARTESIAN_POINT ( 'NONE',  ( 0.7968849502188040113, 3.575285967953119926, 4.000000000000000000 ) ) ;
#601 = VERTEX_POINT ( 'NONE', #475 ) ;
#602 = PLANE ( 'NONE',  #441 ) ;
#603 = CARTESIAN_POINT ( 'NONE',  ( 5.799999999999999822, 0.0000000000000000000, 0.0000000000000000000 ) ) ;
#604 = EDGE_CURVE ( 'NONE', #321, #154, #742, .T. ) ;
#605 =( NAMED_UNIT ( * ) SI_UNIT ( $, .STERADIAN. ) SOLID_ANGLE_UNIT ( ) );
#606 = ORIENTED_EDGE ( 'NONE', *, *, #1036, .T. ) ;
#607 = LINE ( 'NONE', #217, #194 ) ;
#608 = DIRECTION ( 'NONE',  ( 0.0000000000000000000, -0.0000000000000000000, 1.000000000000000000 ) ) ;
#609 = SURFACE_STYLE_FILL_AREA ( #157 ) ;
#610 = CARTESIAN_POINT ( 'NONE',  ( 0.7968849502188035672, 0.5557657039520100817, 0.0000000000000000000 ) ) ;
#611 = ORIENTED_EDGE ( 'NONE', *, *, #533, .F. ) ;
#612 = PLANE ( 'NONE',  #485 ) ;
#613 = CARTESIAN_POINT ( 'NONE',  ( 0.4968849502188035783, 3.875285967953121524, 3.439681166155048364E-16 ) ) ;
#614 = DIRECTION ( 'NONE',  ( -0.7071067811865470176, 0.0000000000000000000, 0.7071067811865480168 ) ) ;
#615 = CIRCLE ( 'NONE', #992, 0.4120849439305878104 ) ;
#616 =( NAMED_UNIT ( * ) PLANE_ANGLE_UNIT ( ) SI_UNIT ( $, .RADIAN. ) );
#617 = VECTOR ( 'NONE', #1019, 1000.000000000000000 ) ;
#618 = VECTOR ( 'NONE', #919, 1000.000000000000000 ) ;
#619 = VERTEX_POINT ( 'NONE', #170 ) ;
#620 = FACE_OUTER_BOUND ( 'NONE', #1201, .T. ) ;
#621 = ADVANCED_FACE ( 'NONE', ( #251 ), #1117, .T. ) ;
#622 = ORIENTED_EDGE ( 'NONE', *, *, #604, .F. ) ;
#623 = FILL_AREA_STYLE_COLOUR ( '', #193 ) ;
#624 = CARTESIAN_POINT ( 'NONE',  ( 1.620000000000000107, 0.0000000000000000000, 3.000000000000000000 ) ) ;
#625 = ORIENTED_EDGE ( 'NONE', *, *, #860, .T. ) ;
#626 = LINE ( 'NONE', #792, #155 ) ;
#627 = DIRECTION ( 'NONE',  ( 1.202734330668879482E-16, 0.7071067811865475727, -0.7071067811865475727 ) ) ;
#628 = EDGE_CURVE ( 'NONE', #1106, #619, #71, .T. ) ;
#629 = PLANE ( 'NONE',  #867 ) ;
#630 = APPLICATION_PROTOCOL_DEFINITION ( 'draft international standard', 'automotive_design', 1998, #655 ) ;
#631 = ORIENTED_EDGE ( 'NONE', *, *, #182, .T. ) ;
#632 = CARTESIAN_POINT ( 'NONE',  ( 1.214339852988040036, 3.725285967953119837, 0.1499999999999999944 ) ) ;
#633 = ORIENTED_EDGE ( 'NONE', *, *, #604, .T. ) ;
#634 = DIRECTION ( 'NONE',  ( 0.0000000000000000000, 0.0000000000000000000, -1.000000000000000000 ) ) ;
#635 = UNCERTAINTY_MEASURE_WITH_UNIT (LENGTH_MEASURE( 1.000000000000000082E-05 ), #244, 'distance_accuracy_value', 'NONE');
#636 = EDGE_CURVE ( 'NONE', #886, #770, #276, .T. ) ;
#637 = AXIS2_PLACEMENT_3D ( 'NONE', #1179, #1072, #913 ) ;
#638 = ORIENTED_EDGE ( 'NONE', *, *, #855, .T. ) ;
#639 = AXIS2_PLACEMENT_3D ( 'NONE', #460, #646, #732 ) ;
#640 = FACE_OUTER_BOUND ( 'NONE', #1132, .T. ) ;
#641 = MECHANICAL_DESIGN_GEOMETRIC_PRESENTATION_REPRESENTATION (  '', ( #1031 ), #1158 ) ;
#642 = VERTEX_POINT ( 'NONE', #355 ) ;
#643 = SURFACE_STYLE_USAGE ( .BOTH. , #180 ) ;
#644 = EDGE_CURVE ( 'NONE', #404, #642, #370, .T. ) ;
#645 = ORIENTED_EDGE ( 'NONE', *, *, #982, .F. ) ;
#646 = DIRECTION ( 'NONE',  ( -0.0000000000000000000, 1.000000000000000000, -0.0000000000000000000 ) ) ;
#647 = ORIENTED_EDGE ( 'NONE', *, *, #751, .F. ) ;
#648 = CARTESIAN_POINT ( 'NONE',  ( 5.799999999999999822, 0.0000000000000000000, 2.898498936299870543 ) ) ;
#649 = DIRECTION ( 'NONE',  ( -1.000000000000000000, 6.803692809454639758E-16, 0.0000000000000000000 ) ) ;
#650 = EDGE_LOOP ( 'NONE', ( #996, #257, #325, #645 ) ) ;
#651 = DIRECTION ( 'NONE',  ( -4.810937322675529759E-16, -0.7071067811865470176, -0.7071067811865480168 ) ) ;
#652 = ORIENTED_EDGE ( 'NONE', *, *, #186, .T. ) ;
#653 = CARTESIAN_POINT ( 'NONE',  ( 2.428679705976080072, 0.5557657039520099707, 0.0000000000000000000 ) ) ;
#654 = CARTESIAN_POINT ( 'NONE',  ( 0.0000000000000000000, 3.871376290216600236, 0.0000000000000000000 ) ) ;
#655 = APPLICATION_CONTEXT ( 'automotive_design' ) ;
#656 = CIRCLE ( 'NONE', #678, 1.036866490221470150 ) ;
#657 = CARTESIAN_POINT ( 'NONE',  ( 0.0000000000000000000, 7.826365425634999262, 1.571680007585130046 ) ) ;
#658 = CARTESIAN_POINT ( 'NONE',  ( 2.728679705976079894, 3.875285967953120192, -7.048905386272298765E-16 ) ) ;
#659 =( GEOMETRIC_REPRESENTATION_CONTEXT ( 3 ) GLOBAL_UNCERTAINTY_ASSIGNED_CONTEXT ( ( #24 ) ) GLOBAL_UNIT_ASSIGNED_CONTEXT ( ( #554, #560, #1041 ) ) REPRESENTATION_CONTEXT ( 'NONE', 'WORKASPACE' ) );
#660 = ORIENTED_EDGE ( 'NONE', *, *, #122, .T. ) ;
#661 = FILL_AREA_STYLE ('',( #1034 ) ) ;
#662 = AXIS2_PLACEMENT_3D ( 'NONE', #1062, #717, #45 ) ;
#663 = EDGE_CURVE ( 'NONE', #1058, #1087, #553, .T. ) ;
#664 = LINE ( 'NONE', #1035, #1100 ) ;
#665 = DIRECTION ( 'NONE',  ( 0.0000000000000000000, 1.000000000000000000, 0.0000000000000000000 ) ) ;
#666 = ORIENTED_EDGE ( 'NONE', *, *, #663, .T. ) ;
#667 = CARTESIAN_POINT ( 'NONE',  ( 0.0000000000000000000, 7.826365425634999262, 1.571680007585129379 ) ) ;
#668 = FILL_AREA_STYLE_COLOUR ( '', #796 ) ;
#669 = ADVANCED_FACE ( 'NONE', ( #559 ), #927, .T. ) ;
#670 = PRESENTATION_STYLE_ASSIGNMENT (( #478 ) ) ;
#671 = ORIENTED_EDGE ( 'NONE', *, *, #892, .F. ) ;
#672 = CARTESIAN_POINT ( 'NONE',  ( 3.243578687218610312, 1.785688145108299985, 0.1499999999999999944 ) ) ;
#673 = LINE ( 'NONE', #406, #758 ) ;
#674 = UNCERTAINTY_MEASURE_WITH_UNIT (LENGTH_MEASURE( 1.000000000000000082E-05 ), #1057, 'distance_accuracy_value', 'NONE');
#675 = EDGE_CURVE ( 'NONE', #822, #430, #265, .T. ) ;
#676 = CARTESIAN_POINT ( 'NONE',  ( 4.160000000000000142, 0.0000000000000000000, 3.000000000000000000 ) ) ;
#677 = ORIENTED_EDGE ( 'NONE', *, *, #186, .F. ) ;
#678 = AXIS2_PLACEMENT_3D ( 'NONE', #888, #373, #749 ) ;
#679 = FACE_OUTER_BOUND ( 'NONE', #949, .T. ) ;
#680 = SURFACE_SIDE_STYLE ('',( #120 ) ) ;
#681 = VECTOR ( 'NONE', #482, 1000.000000000000114 ) ;
#682 = DIRECTION ( 'NONE',  ( 0.0000000000000000000, -0.0000000000000000000, 1.000000000000000000 ) ) ;
#683 = PRODUCT_DEFINITION ( 'UNKNOWN', '', #874, #810 ) ;
#684 = EDGE_LOOP ( 'NONE', ( #207, #576, #854, #224 ) ) ;
#685 = PLANE ( 'NONE',  #174 ) ;
#686 = DIRECTION ( 'NONE',  ( 1.000000000000000000, 0.0000000000000000000, -0.0000000000000000000 ) ) ;
#687 = PLANE ( 'NONE',  #969 ) ;
#688 = ORIENTED_EDGE ( 'NONE', *, *, #381, .T. ) ;
#689 = PLANE ( 'NONE',  #1029 ) ;
#690 = FILL_AREA_STYLE_COLOUR ( '', #565 ) ;
#691 = CARTESIAN_POINT ( 'NONE',  ( 0.7968849502188039002, 3.575285967953120814, 0.3000000000000000444 ) ) ;
#692 = CARTESIAN_POINT ( 'NONE',  ( 1.643701232102960041, 7.326365425635000150, 3.010496517392910132 ) ) ;
#693 = VERTEX_POINT ( 'NONE', #747 ) ;
#694 = CARTESIAN_POINT ( 'NONE',  ( 0.0000000000000000000, 5.029886257090540269, 0.6996596599081911227 ) ) ;
#695 =( GEOMETRIC_REPRESENTATION_CONTEXT ( 3 ) GLOBAL_UNCERTAINTY_ASSIGNED_CONTEXT ( ( #245 ) ) GLOBAL_UNIT_ASSIGNED_CONTEXT ( ( #987, #241, #730 ) ) REPRESENTATION_CONTEXT ( 'NONE', 'WORKASPACE' ) );
#696 = EDGE_LOOP ( 'NONE', ( #1007, #5, #526, #956 ) ) ;
#697 = EDGE_CURVE ( 'NONE', #446, #332, #1027, .T. ) ;
#698 = VECTOR ( 'NONE', #634, 1000.000000000000000 ) ;
#699 = VECTOR ( 'NONE', #1133, 1000.000000000000000 ) ;
#700 = DIRECTION ( 'NONE',  ( 0.0000000000000000000, -1.000000000000000000, 0.0000000000000000000 ) ) ;
#701 = VERTEX_POINT ( 'NONE', #856 ) ;
#702 = DIRECTION ( 'NONE',  ( -1.838409627286330118E-16, -1.000000000000000000, 0.0000000000000000000 ) ) ;
#703 = ORIENTED_EDGE ( 'NONE', *, *, #759, .F. ) ;
#704 = SURFACE_STYLE_USAGE ( .BOTH. , #219 ) ;
#705 = DIRECTION ( 'NONE',  ( 0.0000000000000000000, 0.0000000000000000000, -1.000000000000000000 ) ) ;
#706 = DIRECTION ( 'NONE',  ( -0.0000000000000000000, 1.000000000000000000, -0.0000000000000000000 ) ) ;
#707 = ORIENTED_EDGE ( 'NONE', *, *, #902, .F. ) ;
#708 = LINE ( 'NONE', #1080, #780 ) ;
#709 = CARTESIAN_POINT ( 'NONE',  ( 1.620000000000000107, -4.000000000000000000, 3.000000000000000000 ) ) ;
#710 = CARTESIAN_POINT ( 'NONE',  ( 5.025373442975880067, 3.571376290216599969, 0.0000000000000000000 ) ) ;
#711 = EDGE_CURVE ( 'NONE', #339, #1014, #584, .T. ) ;
#712 = VERTEX_POINT ( 'NONE', #119 ) ;
#713 = DIRECTION ( 'NONE',  ( 0.0000000000000000000, 1.000000000000000000, 0.0000000000000000000 ) ) ;
#714 = FILL_AREA_STYLE ('',( #334 ) ) ;
#715 = AXIS2_PLACEMENT_3D ( 'NONE', #351, #226, #1185 ) ;
#716 = VECTOR ( 'NONE', #464, 1000.000000000000000 ) ;
#717 = DIRECTION ( 'NONE',  ( 1.000000000000000000, 0.0000000000000000000, 0.0000000000000000000 ) ) ;
#718 = VECTOR ( 'NONE', #864, 1000.000000000000000 ) ;
#719 = VECTOR ( 'NONE', #1046, 1000.000000000000000 ) ;
#720 = ORIENTED_EDGE ( 'NONE', *, *, #1068, .T. ) ;
#721 = EDGE_CURVE ( 'NONE', #1148, #1106, #294, .T. ) ;
#722 = CARTESIAN_POINT ( 'NONE',  ( 0.0000000000000000000, 0.0000000000000000000, 6.021990747453619619 ) ) ;
#723 = ORIENTED_EDGE ( 'NONE', *, *, #711, .T. ) ;
#724 = CARTESIAN_POINT ( 'NONE',  ( 0.0000000000000000000, 5.029886257090540269, 0.0000000000000000000 ) ) ;
#725 = ORIENTED_EDGE ( 'NONE', *, *, #636, .F. ) ;
#726 = CARTESIAN_POINT ( 'NONE',  ( 1.643701232102960264, 7.326365425635000150, 4.047363007614380059 ) ) ;
#727 = ORIENTED_EDGE ( 'NONE', *, *, #855, .F. ) ;
#728 = PLANE ( 'NONE',  #1174 ) ;
#729 = ADVANCED_FACE ( 'NONE', ( #1054 ), #685, .T. ) ;
#730 =( NAMED_UNIT ( * ) SI_UNIT ( $, .STERADIAN. ) SOLID_ANGLE_UNIT ( ) );
#731 = VERTEX_POINT ( 'NONE', #593 ) ;
#732 = DIRECTION ( 'NONE',  ( 0.0000000000000000000, 0.0000000000000000000, -1.000000000000000000 ) ) ;
#733 = ORIENTED_EDGE ( 'NONE', *, *, #158, .T. ) ;
#734 = DIRECTION ( 'NONE',  ( 0.0000000000000000000, -1.000000000000000000, 0.0000000000000000000 ) ) ;
#735 = EDGE_CURVE ( 'NONE', #819, #134, #300, .T. ) ;
#736 = PRODUCT_DEFINITION_SHAPE ( 'NONE', 'NONE',  #683 ) ;
#737 = EDGE_LOOP ( 'NONE', ( #931, #1108, #725, #369 ) ) ;
#738 = VECTOR ( 'NONE', #531, 1000.000000000000000 ) ;
#739 = LINE ( 'NONE', #658, #1047 ) ;
#740 = VECTOR ( 'NONE', #508, 1000.000000000000000 ) ;
#741 = ORIENTED_EDGE ( 'NONE', *, *, #479, .T. ) ;
#742 = LINE ( 'NONE', #648, #698 ) ;
#743 = CARTESIAN_POINT ( 'NONE',  ( 0.4968849502188039668, 0.0000000000000000000, 0.0000000000000000000 ) ) ;
#744 = ORIENTED_EDGE ( 'NONE', *, *, #735, .F. ) ;
#745 = DIRECTION ( 'NONE',  ( 1.000000000000000000, -1.700923202363659940E-16, 0.0000000000000000000 ) ) ;
#746 = ORIENTED_EDGE ( 'NONE', *, *, #793, .T. ) ;
#747 = CARTESIAN_POINT ( 'NONE',  ( 5.025373442975879179, 3.571376290216599969, 0.2999999999999999334 ) ) ;
#748 = CARTESIAN_POINT ( 'NONE',  ( 2.428679705976080072, 0.5557657039520099707, 4.000000000000000000 ) ) ;
#749 = DIRECTION ( 'NONE',  ( 0.0000000000000000000, 0.0000000000000000000, -1.000000000000000000 ) ) ;
#750 = CARTESIAN_POINT ( 'NONE',  ( 1.620000000000000107, 0.0000000000000000000, 3.412084943930588032 ) ) ;
#751 = EDGE_CURVE ( 'NONE', #822, #752, #950, .T. ) ;
#752 = VERTEX_POINT ( 'NONE', #393 ) ;
#753 = DIRECTION ( 'NONE',  ( 0.0000000000000000000, -1.000000000000000000, 0.0000000000000000000 ) ) ;
#754 = CARTESIAN_POINT ( 'NONE',  ( 0.0000000000000000000, 3.475442759505510182, 2.898498936299870543 ) ) ;
#755 = AXIS2_PLACEMENT_3D ( 'NONE', #1114, #32, #413 ) ;
#756 = DIRECTION ( 'NONE',  ( -0.0000000000000000000, 1.000000000000000000, -0.0000000000000000000 ) ) ;
#757 = DIRECTION ( 'NONE',  ( 0.0000000000000000000, -1.000000000000000000, 0.0000000000000000000 ) ) ;
#758 = VECTOR ( 'NONE', #290, 1000.000000000000000 ) ;
#759 = EDGE_CURVE ( 'NONE', #842, #486, #1049, .T. ) ;
#760 =( GEOMETRIC_REPRESENTATION_CONTEXT ( 3 ) GLOBAL_UNCERTAINTY_ASSIGNED_CONTEXT ( ( #1176 ) ) GLOBAL_UNIT_ASSIGNED_CONTEXT ( ( #88, #547, #921 ) ) REPRESENTATION_CONTEXT ( 'NONE', 'WORKASPACE' ) );
#761 = EDGE_LOOP ( 'NONE', ( #1208, #688 ) ) ;
#762 = CARTESIAN_POINT ( 'NONE',  ( 4.171811191128179885, 7.826365425634999262, 1.973630027171440204 ) ) ;
#763 = DIRECTION ( 'NONE',  ( -0.0000000000000000000, 1.000000000000000000, -0.0000000000000000000 ) ) ;
#764 = LINE ( 'NONE', #205, #439 ) ;
#765 = ORIENTED_EDGE ( 'NONE', *, *, #663, .F. ) ;
#766 = CARTESIAN_POINT ( 'NONE',  ( 0.0000000000000000000, 2.534103773335810050, 6.021990747453619619 ) ) ;
#767 = DIRECTION ( 'NONE',  ( 1.000000000000000000, -0.0000000000000000000, 0.0000000000000000000 ) ) ;
#768 = EDGE_CURVE ( 'NONE', #1111, #404, #405, .T. ) ;
#769 =( LENGTH_UNIT ( ) NAMED_UNIT ( * ) SI_UNIT ( .MILLI., .METRE. ) );
#770 = VERTEX_POINT ( 'NONE', #957 ) ;
#771 = FACE_OUTER_BOUND ( 'NONE', #504, .T. ) ;
#772 =( NAMED_UNIT ( * ) PLANE_ANGLE_UNIT ( ) SI_UNIT ( $, .RADIAN. ) );
#773 = ADVANCED_FACE ( 'NONE', ( #1040 ), #104, .F. ) ;
#774 = DIRECTION ( 'NONE',  ( 0.0000000000000000000, 0.0000000000000000000, -1.000000000000000000 ) ) ;
#775 = ORIENTED_EDGE ( 'NONE', *, *, #311, .F. ) ;
#776 = AXIS2_PLACEMENT_3D ( 'NONE', #1210, #1147, #307 ) ;
#777 = CARTESIAN_POINT ( 'NONE',  ( 4.171811191128179885, 7.826365425634999262, 3.010496517392910132 ) ) ;
#778 = VECTOR ( 'NONE', #126, 1000.000000000000000 ) ;
#779 = DIRECTION ( 'NONE',  ( 0.0000000000000000000, 1.000000000000000000, 0.0000000000000000000 ) ) ;
#780 = VECTOR ( 'NONE', #1173, 999.9999999999998863 ) ;
#781 = ORIENTED_EDGE ( 'NONE', *, *, #1020, .F. ) ;
#782 = CARTESIAN_POINT ( 'NONE',  ( 0.7968849502188034561, 1.787642983976559963, 0.3000000000000004885 ) ) ;
#783 = DIRECTION ( 'NONE',  ( 0.0000000000000000000, -1.000000000000000000, 0.0000000000000000000 ) ) ;
#784 = CARTESIAN_POINT ( 'NONE',  ( 4.171811191128179885, 7.826365425634999262, 3.010496517392910132 ) ) ;
#785 = VERTEX_POINT ( 'NONE', #762 ) ;
#786 = ADVANCED_FACE ( 'NONE', ( #771 ), #487, .F. ) ;
#787 = CARTESIAN_POINT ( 'NONE',  ( 5.800000000000000711, 5.029886257090540269, 0.6996596599081911227 ) ) ;
#788 = FACE_OUTER_BOUND ( 'NONE', #216, .T. ) ;
#789 = CARTESIAN_POINT ( 'NONE',  ( 5.799999999999999822, 5.029886257090540269, 0.0000000000000000000 ) ) ;
#790 = DIRECTION ( 'NONE',  ( -0.0000000000000000000, -1.000000000000000000, -0.0000000000000000000 ) ) ;
#791 = ORIENTED_EDGE ( 'NONE', *, *, #644, .F. ) ;
#792 = CARTESIAN_POINT ( 'NONE',  ( 0.0000000000000000000, 7.826365425634999262, 4.368159053583569928 ) ) ;
#793 = EDGE_CURVE ( 'NONE', #1144, #1087, #385, .T. ) ;
#794 = AXIS2_PLACEMENT_3D ( 'NONE', #784, #477, #1037 ) ;
#795 = LINE ( 'NONE', #613, #1216 ) ;
#796 = COLOUR_RGB ( '',0.1254901960784313708, 0.5372549019607842924, 0.1254901960784313708 ) ;
#797 = VECTOR ( 'NONE', #813, 1000.000000000000000 ) ;
#798 = LINE ( 'NONE', #710, #233 ) ;
#799 =( GEOMETRIC_REPRESENTATION_CONTEXT ( 3 ) GLOBAL_UNCERTAINTY_ASSIGNED_CONTEXT ( ( #191 ) ) GLOBAL_UNIT_ASSIGNED_CONTEXT ( ( #408, #616, #308 ) ) REPRESENTATION_CONTEXT ( 'NONE', 'WORKASPACE' ) );
#800 = VERTEX_POINT ( 'NONE', #667 ) ;
#801 = LINE ( 'NONE', #600, #738 ) ;
#802 = FACE_OUTER_BOUND ( 'NONE', #884, .T. ) ;
#803 = PLANE ( 'NONE',  #540 ) ;
#804 = ADVANCED_FACE ( 'NONE', ( #679 ), #689, .T. ) ;
#805 = CYLINDRICAL_SURFACE ( 'NONE', #176, 1.036866490221470150 ) ;
#806 = ORIENTED_EDGE ( 'NONE', *, *, #94, .F. ) ;
#807 = DIRECTION ( 'NONE',  ( 0.0000000000000000000, -1.000000000000000000, 0.0000000000000000000 ) ) ;
#808 = ORIENTED_EDGE ( 'NONE', *, *, #304, .T. ) ;
#809 = DIRECTION ( 'NONE',  ( 0.5773502691896255090, -0.5773502691896261751, 0.5773502691896256200 ) ) ;
#810 = PRODUCT_DEFINITION_CONTEXT ( 'detailed design', #655, 'design' ) ;
#811 = CARTESIAN_POINT ( 'NONE',  ( 2.578679705976079983, 0.2778828519760049853, 0.1499999999999999944 ) ) ;
#812 = ORIENTED_EDGE ( 'NONE', *, *, #323, .F. ) ;
#813 = DIRECTION ( 'NONE',  ( -1.000000000000000000, 0.0000000000000000000, -0.0000000000000000000 ) ) ;
#814 = ORIENTED_EDGE ( 'NONE', *, *, #90, .T. ) ;
#815 = PLANE ( 'NONE',  #637 ) ;
#816 = AXIS2_PLACEMENT_3D ( 'NONE', #93, #1127, #1197 ) ;
#817 = VECTOR ( 'NONE', #305, 1000.000000000000000 ) ;
#818 = PRESENTATION_LAYER_ASSIGNMENT (  '', '', ( #857 ) ) ;
#819 = VERTEX_POINT ( 'NONE', #98 ) ;
#820 = DIRECTION ( 'NONE',  ( 0.0000000000000000000, 0.0000000000000000000, -1.000000000000000000 ) ) ;
#821 = EDGE_CURVE ( 'NONE', #62, #842, #10, .T. ) ;
#822 = VERTEX_POINT ( 'NONE', #1141 ) ;
#823 = DIRECTION ( 'NONE',  ( -0.0000000000000000000, 1.000000000000000000, -0.0000000000000000000 ) ) ;
#824 = CARTESIAN_POINT ( 'NONE',  ( 1.643701232102960041, 7.826365425634999262, 3.010496517392910132 ) ) ;
#825 = DIRECTION ( 'NONE',  ( 1.000000000000000000, 0.0000000000000000000, 0.0000000000000000000 ) ) ;
#826 = EDGE_CURVE ( 'NONE', #430, #446, #199, .T. ) ;
#827 = VERTEX_POINT ( 'NONE', #965 ) ;
#828 =( LENGTH_UNIT ( ) NAMED_UNIT ( * ) SI_UNIT ( .MILLI., .METRE. ) );
#829 = CARTESIAN_POINT ( 'NONE',  ( 0.7968849502188041223, 3.575285967953120370, 4.000000000000000000 ) ) ;
#830 = ORIENTED_EDGE ( 'NONE', *, *, #793, .F. ) ;
#831 = ORIENTED_EDGE ( 'NONE', *, *, #967, .F. ) ;
#832 = DIRECTION ( 'NONE',  ( 0.0000000000000000000, 0.0000000000000000000, -1.000000000000000000 ) ) ;
#833 = LINE ( 'NONE', #1214, #419 ) ;
#834 = ORIENTED_EDGE ( 'NONE', *, *, #1181, .F. ) ;
#835 = VECTOR ( 'NONE', #268, 1000.000000000000000 ) ;
#836 = CARTESIAN_POINT ( 'NONE',  ( 5.799999999999999822, 7.826365425634999262, 4.368159053583569928 ) ) ;
#837 = VERTEX_POINT ( 'NONE', #113 ) ;
#838 = PRESENTATION_STYLE_ASSIGNMENT (( #643 ) ) ;
#839 = CARTESIAN_POINT ( 'NONE',  ( 1.620000000000000107, -4.000000000000000000, 3.000000000000000000 ) ) ;
#840 = ADVANCED_FACE ( 'NONE', ( #496 ), #870, .T. ) ;
#841 = EDGE_LOOP ( 'NONE', ( #53, #707, #1075, #703 ) ) ;
#842 = VERTEX_POINT ( 'NONE', #1070 ) ;
#843 = FACE_OUTER_BOUND ( 'NONE', #130, .T. ) ;
#844 = EDGE_CURVE ( 'NONE', #1111, #339, #801, .T. ) ;
#845 = DIRECTION ( 'NONE',  ( -0.0000000000000000000, -0.0000000000000000000, -1.000000000000000000 ) ) ;
#846 = DIRECTION ( 'NONE',  ( 0.0000000000000000000, 1.000000000000000000, 0.0000000000000000000 ) ) ;
#847 = VERTEX_POINT ( 'NONE', #47 ) ;
#848 = DIRECTION ( 'NONE',  ( -0.7071067811865474617, 0.0000000000000000000, -0.7071067811865474617 ) ) ;
#849 = DIRECTION ( 'NONE',  ( 0.0000000000000000000, 0.0000000000000000000, -1.000000000000000000 ) ) ;
#850 = DIRECTION ( 'NONE',  ( 0.0000000000000000000, -0.0000000000000000000, 1.000000000000000000 ) ) ;
#851 = CARTESIAN_POINT ( 'NONE',  ( 5.325373442975881666, 0.2518560262154908025, 1.516881854376340590E-16 ) ) ;
#852 = VECTOR ( 'NONE', #1146, 1000.000000000000000 ) ;
#853 = VECTOR ( 'NONE', #900, 1000.000000000000000 ) ;
#854 = ORIENTED_EDGE ( 'NONE', *, *, #967, .T. ) ;
#855 = EDGE_CURVE ( 'NONE', #785, #731, #607, .T. ) ;
#856 = CARTESIAN_POINT ( 'NONE',  ( 1.643701232102960041, 7.826365425634999262, 1.973630027171440204 ) ) ;
#857 = STYLED_ITEM ( 'NONE', ( #141 ), #289 ) ;
#858 = ORIENTED_EDGE ( 'NONE', *, *, #347, .T. ) ;
#859 = DIRECTION ( 'NONE',  ( 0.0000000000000000000, 0.0000000000000000000, -1.000000000000000000 ) ) ;
#860 = EDGE_CURVE ( 'NONE', #530, #168, #1167, .T. ) ;
#861 = LINE ( 'NONE', #209, #383 ) ;
#862 = CARTESIAN_POINT ( 'NONE',  ( 4.160000000000000142, -4.000000000000000000, 2.587915056069412412 ) ) ;
#863 = ORIENTED_EDGE ( 'NONE', *, *, #69, .F. ) ;
#864 = DIRECTION ( 'NONE',  ( 1.000000000000000000, -0.0000000000000000000, 0.0000000000000000000 ) ) ;
#865 = CARTESIAN_POINT ( 'NONE',  ( 1.643701232102960041, 7.826365425634999262, 1.973630027171440204 ) ) ;
#866 = CARTESIAN_POINT ( 'NONE',  ( 2.428679705976080072, 0.5557657039520099707, 4.000000000000000000 ) ) ;
#867 = AXIS2_PLACEMENT_3D ( 'NONE', #538, #252, #44 ) ;
#868 = EDGE_LOOP ( 'NONE', ( #1162, #631, #606, #28 ) ) ;
#869 = AXIS2_PLACEMENT_3D ( 'NONE', #537, #823, #1184 ) ;
#870 = PLANE ( 'NONE',  #1013 ) ;
#871 = VECTOR ( 'NONE', #962, 1000.000000000000000 ) ;
#872 = LINE ( 'NONE', #966, #1102 ) ;
#873 = MECHANICAL_DESIGN_GEOMETRIC_PRESENTATION_REPRESENTATION (  '', ( #2 ), #175 ) ;
#874 = PRODUCT_DEFINITION_FORMATION_WITH_SPECIFIED_SOURCE ( 'ANY', '', #316, .NOT_KNOWN. ) ;
#875 = CARTESIAN_POINT ( 'NONE',  ( 1.620000000000000107, 0.0000000000000000000, 3.000000000000000000 ) ) ;
#876 = ADVANCED_FACE ( 'NONE', ( #129, #518, #326 ), #1076, .T. ) ;
#877 = VERTEX_POINT ( 'NONE', #341 ) ;
#878 = DIRECTION ( 'NONE',  ( 1.000000000000000000, -1.700923202363659940E-16, 0.0000000000000000000 ) ) ;
#879 = VERTEX_POINT ( 'NONE', #136 ) ;
#880 = PLANE ( 'NONE',  #1199 ) ;
#881 = FACE_OUTER_BOUND ( 'NONE', #345, .T. ) ;
#882 = DIRECTION ( 'NONE',  ( 0.0000000000000000000, 0.0000000000000000000, -1.000000000000000000 ) ) ;
#883 = ADVANCED_FACE ( 'NONE', ( #230, #35, #620 ), #612, .T. ) ;
#884 = EDGE_LOOP ( 'NONE', ( #380, #21 ) ) ;
#885 = DIRECTION ( 'NONE',  ( 0.0000000000000000000, -0.9544799817562733546, 0.2982749812279670842 ) ) ;
#886 = VERTEX_POINT ( 'NONE', #411 ) ;
#887 = CARTESIAN_POINT ( 'NONE',  ( 5.799999999999999822, 7.826365425634999262, 2.898498936299870543 ) ) ;
#888 = CARTESIAN_POINT ( 'NONE',  ( 4.171811191128179885, 7.826365425634999262, 3.010496517392910132 ) ) ;
#889 = LINE ( 'NONE', #610, #740 ) ;
#890 = ORIENTED_EDGE ( 'NONE', *, *, #1198, .T. ) ;
#891 = CARTESIAN_POINT ( 'NONE',  ( 0.0000000000000000000, 5.029886257090540269, 2.898498936299870543 ) ) ;
#892 = EDGE_CURVE ( 'NONE', #332, #693, #125, .T. ) ;
#893 = AXIS2_PLACEMENT_3D ( 'NONE', #1118, #763, #1209 ) ;
#894 = EDGE_LOOP ( 'NONE', ( #102, #1166, #812, #146 ) ) ;
#895 = CARTESIAN_POINT ( 'NONE',  ( 5.799999999999999822, 7.826365425634999262, 4.368159053583569928 ) ) ;
#896 = VECTOR ( 'NONE', #43, 1000.000000000000000 ) ;
#897 = CARTESIAN_POINT ( 'NONE',  ( 1.620000000000000107, 0.0000000000000000000, 2.587915056069412412 ) ) ;
#898 = DIRECTION ( 'NONE',  ( 0.0000000000000000000, -1.000000000000000000, 0.0000000000000000000 ) ) ;
#899 = ORIENTED_EDGE ( 'NONE', *, *, #636, .T. ) ;
#900 = DIRECTION ( 'NONE',  ( 0.0000000000000000000, 1.000000000000000000, 0.0000000000000000000 ) ) ;
#901 = DIRECTION ( 'NONE',  ( 1.000000000000000000, -0.0000000000000000000, 0.0000000000000000000 ) ) ;
#902 = EDGE_CURVE ( 'NONE', #601, #642, #984, .T. ) ;
#903 = PLANE ( 'NONE',  #715 ) ;
#904 = CARTESIAN_POINT ( 'NONE',  ( 5.799999999999999822, 5.029886257090540269, 0.0000000000000000000 ) ) ;
#905 = EDGE_LOOP ( 'NONE', ( #1151, #582, #202, #939 ) ) ;
#906 = CARTESIAN_POINT ( 'NONE',  ( 2.728679705976079894, 0.2557657039520099818, -1.626303258728256651E-16 ) ) ;
#907 = ORIENTED_EDGE ( 'NONE', *, *, #697, .T. ) ;
#908 = FILL_AREA_STYLE ('',( #623 ) ) ;
#909 = ORIENTED_EDGE ( 'NONE', *, *, #821, .F. ) ;
#910 = FACE_OUTER_BOUND ( 'NONE', #264, .T. ) ;
#911 = ORIENTED_EDGE ( 'NONE', *, *, #947, .T. ) ;
#912 = VECTOR ( 'NONE', #221, 1000.000000000000000 ) ;
#913 = DIRECTION ( 'NONE',  ( 1.000000000000000000, -1.700923202363659940E-16, 0.0000000000000000000 ) ) ;
#914 = STYLED_ITEM ( 'NONE', ( #163 ), #376 ) ;
#915 = VECTOR ( 'NONE', #1088, 1000.000000000000000 ) ;
#916 =( GEOMETRIC_REPRESENTATION_CONTEXT ( 3 ) GLOBAL_UNCERTAINTY_ASSIGNED_CONTEXT ( ( #1004 ) ) GLOBAL_UNIT_ASSIGNED_CONTEXT ( ( #995, #132, #605 ) ) REPRESENTATION_CONTEXT ( 'NONE', 'WORKASPACE' ) );
#917 = ADVANCED_FACE ( 'NONE', ( #910 ), #237, .F. ) ;
#918 = ORIENTED_EDGE ( 'NONE', *, *, #1189, .T. ) ;
#919 = DIRECTION ( 'NONE',  ( 0.0000000000000000000, 1.000000000000000000, 0.0000000000000000000 ) ) ;
#920 = ORIENTED_EDGE ( 'NONE', *, *, #1150, .T. ) ;
#921 =( NAMED_UNIT ( * ) SI_UNIT ( $, .STERADIAN. ) SOLID_ANGLE_UNIT ( ) );
#922 = SURFACE_STYLE_FILL_AREA ( #181 ) ;
#923 = PRODUCT_CONTEXT ( 'NONE', #589, 'mechanical' ) ;
#924 = LINE ( 'NONE', #72, #1136 ) ;
#925 = CARTESIAN_POINT ( 'NONE',  ( 2.428679705976080072, 0.5557657039520099707, 0.0000000000000000000 ) ) ;
#926 = ORIENTED_EDGE ( 'NONE', *, *, #145, .F. ) ;
#927 = PLANE ( 'NONE',  #117 ) ;
#928 = SHAPE_DEFINITION_REPRESENTATION ( #736, #289 ) ;
#929 = ORIENTED_EDGE ( 'NONE', *, *, #1068, .F. ) ;
#930 = PLANE ( 'NONE',  #1156 ) ;
#931 = ORIENTED_EDGE ( 'NONE', *, *, #311, .T. ) ;
#932 = EDGE_CURVE ( 'NONE', #837, #877, #54, .T. ) ;
#933 = AXIS2_PLACEMENT_3D ( 'NONE', #1186, #352, #549 ) ;
#934 = VECTOR ( 'NONE', #734, 1000.000000000000000 ) ;
#935 = VECTOR ( 'NONE', #783, 1000.000000000000000 ) ;
#936 = PLANE ( 'NONE',  #933 ) ;
#937 = VECTOR ( 'NONE', #1193, 1000.000000000000000 ) ;
#938 = LINE ( 'NONE', #59, #617 ) ;
#939 = ORIENTED_EDGE ( 'NONE', *, *, #628, .T. ) ;
#940 = DIRECTION ( 'NONE',  ( 0.0000000000000000000, 0.0000000000000000000, -1.000000000000000000 ) ) ;
#941 = CARTESIAN_POINT ( 'NONE',  ( 2.428679705976080072, 3.575285967953119926, 0.0000000000000000000 ) ) ;
#942 = EDGE_CURVE ( 'NONE', #154, #1153, #1163, .T. ) ;
#943 = CARTESIAN_POINT ( 'NONE',  ( 3.393578687218609780, 0.5518560262154910134, 4.000000000000000000 ) ) ;
#944 = CARTESIAN_POINT ( 'NONE',  ( 1.620000000000000107, 0.0000000000000000000, 3.000000000000000000 ) ) ;
#945 = ORIENTED_EDGE ( 'NONE', *, *, #57, .T. ) ;
#946 = DIRECTION ( 'NONE',  ( 0.0000000000000000000, -1.000000000000000000, 0.0000000000000000000 ) ) ;
#947 = EDGE_CURVE ( 'NONE', #827, #879, #40, .T. ) ;
#948 = LINE ( 'NONE', #314, #382 ) ;
#949 = EDGE_LOOP ( 'NONE', ( #367, #1124, #1026, #1052 ) ) ;
#950 = LINE ( 'NONE', #1044, #524 ) ;
#951 = AXIS2_PLACEMENT_3D ( 'NONE', #811, #1169, #614 ) ;
#952 =( NAMED_UNIT ( * ) SI_UNIT ( $, .STERADIAN. ) SOLID_ANGLE_UNIT ( ) );
#953 = EDGE_CURVE ( 'NONE', #168, #1039, #626, .T. ) ;
#954 = VECTOR ( 'NONE', #901, 1000.000000000000000 ) ;
#955 = AXIS2_PLACEMENT_3D ( 'NONE', #777, #185, #389 ) ;
#956 = ORIENTED_EDGE ( 'NONE', *, *, #138, .T. ) ;
#957 = CARTESIAN_POINT ( 'NONE',  ( 0.4968849502188037448, 3.875285967953121524, 5.891738717791689898E-17 ) ) ;
#958 = COLOUR_RGB ( '',0.9960784313725490335, 0.9960784313725490335, 1.000000000000000000 ) ;
#959 = LINE ( 'NONE', #1055, #852 ) ;
#960 = SURFACE_SIDE_STYLE ('',( #8 ) ) ;
#961 = VERTEX_POINT ( 'NONE', #787 ) ;
#962 = DIRECTION ( 'NONE',  ( 1.000000000000000000, 0.0000000000000000000, -0.0000000000000000000 ) ) ;
#963 = PLANE ( 'NONE',  #172 ) ;
#964 = ORIENTED_EDGE ( 'NONE', *, *, #721, .F. ) ;
#965 = CARTESIAN_POINT ( 'NONE',  ( 4.171811191128179885, 7.826365425634999262, 4.047363007614380059 ) ) ;
#966 = CARTESIAN_POINT ( 'NONE',  ( 0.0000000000000000000, 5.029886257090540269, 0.6996596599081911227 ) ) ;
#967 = EDGE_CURVE ( 'NONE', #642, #847, #1149, .T. ) ;
#968 = DIRECTION ( 'NONE',  ( 1.000000000000000000, 0.0000000000000000000, -0.0000000000000000000 ) ) ;
#969 = AXIS2_PLACEMENT_3D ( 'NONE', #378, #502, #386 ) ;
#970 = EDGE_LOOP ( 'NONE', ( #660, #437 ) ) ;
#971 = VECTOR ( 'NONE', #568, 1000.000000000000000 ) ;
#972 = CARTESIAN_POINT ( 'NONE',  ( 0.7968849502188029010, 0.5557657039520095266, 0.3000000000000001554 ) ) ;
#973 = VECTOR ( 'NONE', #431, 1000.000000000000114 ) ;
#974 =( NAMED_UNIT ( * ) SI_UNIT ( $, .STERADIAN. ) SOLID_ANGLE_UNIT ( ) );
#975 = EDGE_CURVE ( 'NONE', #619, #693, #708, .T. ) ;
#976 = LINE ( 'NONE', #789, #561 ) ;
#977 = LINE ( 'NONE', #227, #156 ) ;
#978 = VERTEX_POINT ( 'NONE', #1065 ) ;
#979 = FACE_OUTER_BOUND ( 'NONE', #179, .T. ) ;
#980 = UNCERTAINTY_MEASURE_WITH_UNIT (LENGTH_MEASURE( 1.000000000000000082E-05 ), #200, 'distance_accuracy_value', 'NONE');
#981 = CARTESIAN_POINT ( 'NONE',  ( 4.209476065097249808, 0.5518560262154910134, 4.000000000000000000 ) ) ;
#982 = EDGE_CURVE ( 'NONE', #961, #877, #436, .T. ) ;
#983 = ORIENTED_EDGE ( 'NONE', *, *, #1143, .T. ) ;
#984 = LINE ( 'NONE', #906, #973 ) ;
#985 = ORIENTED_EDGE ( 'NONE', *, *, #1198, .F. ) ;
#986 = FACE_OUTER_BOUND ( 'NONE', #998, .T. ) ;
#987 =( LENGTH_UNIT ( ) NAMED_UNIT ( * ) SI_UNIT ( .MILLI., .METRE. ) );
#988 = PLANE ( 'NONE',  #662 ) ;
#989 = ORIENTED_EDGE ( 'NONE', *, *, #768, .F. ) ;
#990 = ADVANCED_FACE ( 'NONE', ( #979 ), #930, .F. ) ;
#991 = DIRECTION ( 'NONE',  ( -0.0000000000000000000, -0.0000000000000000000, 1.000000000000000000 ) ) ;
#992 = AXIS2_PLACEMENT_3D ( 'NONE', #839, #1017, #1190 ) ;
#993 = AXIS2_PLACEMENT_3D ( 'NONE', #572, #753, #832 ) ;
#994 = DIRECTION ( 'NONE',  ( 0.0000000000000000000, 0.2976904306488689644, -0.9546624573639056477 ) ) ;
#995 =( LENGTH_UNIT ( ) NAMED_UNIT ( * ) SI_UNIT ( .MILLI., .METRE. ) );
#996 = ORIENTED_EDGE ( 'NONE', *, *, #74, .T. ) ;
#997 = CARTESIAN_POINT ( 'NONE',  ( 0.0000000000000000000, 0.0000000000000000000, 0.0000000000000000000 ) ) ;
#998 = EDGE_LOOP ( 'NONE', ( #1021, #432, #964, #357 ) ) ;
#999 = SURFACE_STYLE_USAGE ( .BOTH. , #239 ) ;
#1000 = PLANE ( 'NONE',  #481 ) ;
#1001 = DIRECTION ( 'NONE',  ( -1.000000000000000000, 0.0000000000000000000, -0.0000000000000000000 ) ) ;
#1002 = DIRECTION ( 'NONE',  ( 0.0000000000000000000, -1.000000000000000000, 0.0000000000000000000 ) ) ;
#1003 = DIRECTION ( 'NONE',  ( -0.0000000000000000000, -0.0000000000000000000, 1.000000000000000000 ) ) ;
#1004 = UNCERTAINTY_MEASURE_WITH_UNIT (LENGTH_MEASURE( 1.000000000000000082E-05 ), #995, 'distance_accuracy_value', 'NONE');
#1005 = EDGE_CURVE ( 'NONE', #842, #642, #368, .T. ) ;
#1006 = PLANE ( 'NONE',  #401 ) ;
#1007 = ORIENTED_EDGE ( 'NONE', *, *, #1012, .F. ) ;
#1008 = SURFACE_STYLE_FILL_AREA ( #661 ) ;
#1009 = VECTOR ( 'NONE', #77, 1000.000000000000000 ) ;
#1010 = FACE_OUTER_BOUND ( 'NONE', #1079, .T. ) ;
#1011 = AXIS2_PLACEMENT_3D ( 'NONE', #709, #1090, #608 ) ;
#1012 = EDGE_CURVE ( 'NONE', #38, #1129, #273, .T. ) ;
#1013 = AXIS2_PLACEMENT_3D ( 'NONE', #22, #1145, #885 ) ;
#1014 = VERTEX_POINT ( 'NONE', #451 ) ;
#1015 = FILL_AREA_STYLE_COLOUR ( '', #240 ) ;
#1016 = ORIENTED_EDGE ( 'NONE', *, *, #953, .F. ) ;
#1017 = DIRECTION ( 'NONE',  ( -0.0000000000000000000, 1.000000000000000000, -0.0000000000000000000 ) ) ;
#1018 = VERTEX_POINT ( 'NONE', #1115 ) ;
#1019 = DIRECTION ( 'NONE',  ( 0.0000000000000000000, -1.000000000000000000, 0.0000000000000000000 ) ) ;
#1020 = EDGE_CURVE ( 'NONE', #546, #1058, #318, .T. ) ;
#1021 = ORIENTED_EDGE ( 'NONE', *, *, #500, .T. ) ;
#1022 = CARTESIAN_POINT ( 'NONE',  ( 0.0000000000000000000, 3.875285967953120636, 0.0000000000000000000 ) ) ;
#1023 = SURFACE_SIDE_STYLE ('',( #922 ) ) ;
#1024 = ORIENTED_EDGE ( 'NONE', *, *, #844, .T. ) ;
#1025 = EDGE_CURVE ( 'NONE', #961, #1018, #1207, .T. ) ;
#1026 = ORIENTED_EDGE ( 'NONE', *, *, #16, .T. ) ;
#1027 = LINE ( 'NONE', #1130, #340 ) ;
#1028 = FACE_OUTER_BOUND ( 'NONE', #552, .T. ) ;
#1029 = AXIS2_PLACEMENT_3D ( 'NONE', #766, #577, #587 ) ;
#1030 = DIRECTION ( 'NONE',  ( -1.000000000000000000, -0.0000000000000000000, 0.0000000000000000000 ) ) ;
#1031 = STYLED_ITEM ( 'NONE', ( #670 ), #1126 ) ;
#1032 = DIRECTION ( 'NONE',  ( -0.5773502691896253980, -0.5773502691896262862, 0.5773502691896257311 ) ) ;
#1033 = ORIENTED_EDGE ( 'NONE', *, *, #975, .T. ) ;
#1034 = FILL_AREA_STYLE_COLOUR ( '', #64 ) ;
#1035 = CARTESIAN_POINT ( 'NONE',  ( 2.428679705976080072, 3.575285967953119926, 0.2999999999999999889 ) ) ;
#1036 = EDGE_CURVE ( 'NONE', #800, #168, #556, .T. ) ;
#1037 = DIRECTION ( 'NONE',  ( 0.0000000000000000000, 0.0000000000000000000, -1.000000000000000000 ) ) ;
#1038 = FILL_AREA_STYLE ('',( #1123 ) ) ;
#1039 = VERTEX_POINT ( 'NONE', #346 ) ;
#1040 = FACE_OUTER_BOUND ( 'NONE', #1213, .T. ) ;
#1041 =( NAMED_UNIT ( * ) SI_UNIT ( $, .STERADIAN. ) SOLID_ANGLE_UNIT ( ) );
#1042 = EDGE_CURVE ( 'NONE', #886, #847, #739, .T. ) ;
#1043 = ORIENTED_EDGE ( 'NONE', *, *, #149, .F. ) ;
#1044 = CARTESIAN_POINT ( 'NONE',  ( 3.393578687218609780, 3.571376290216599969, 0.0000000000000000000 ) ) ;
#1045 = LINE ( 'NONE', #865, #935 ) ;
#1046 = DIRECTION ( 'NONE',  ( 0.0000000000000000000, -1.000000000000000000, -0.0000000000000000000 ) ) ;
#1047 = VECTOR ( 'NONE', #1032, 1000.000000000000000 ) ;
#1048 = VERTEX_POINT ( 'NONE', #726 ) ;
#1049 = LINE ( 'NONE', #972, #681 ) ;
#1050 =( GEOMETRIC_REPRESENTATION_CONTEXT ( 3 ) GLOBAL_UNCERTAINTY_ASSIGNED_CONTEXT ( ( #350 ) ) GLOBAL_UNIT_ASSIGNED_CONTEXT ( ( #263, #563, #394 ) ) REPRESENTATION_CONTEXT ( 'NONE', 'WORKASPACE' ) );
#1051 = SURFACE_STYLE_USAGE ( .BOTH. , #960 ) ;
#1052 = ORIENTED_EDGE ( 'NONE', *, *, #365, .T. ) ;
#1053 = EDGE_CURVE ( 'NONE', #530, #712, #1112, .T. ) ;
#1054 = FACE_OUTER_BOUND ( 'NONE', #222, .T. ) ;
#1055 = CARTESIAN_POINT ( 'NONE',  ( 3.393578687218609780, 0.5518560262154910134, 0.2999999999999999889 ) ) ;
#1056 = CARTESIAN_POINT ( 'NONE',  ( 0.0000000000000000000, 2.534103773335810050, 6.021990747453619619 ) ) ;
#1057 =( LENGTH_UNIT ( ) NAMED_UNIT ( * ) SI_UNIT ( .MILLI., .METRE. ) );
#1058 = VERTEX_POINT ( 'NONE', #255 ) ;
#1059 = DIRECTION ( 'NONE',  ( 0.0000000000000000000, 0.0000000000000000000, -1.000000000000000000 ) ) ;
#1060 = EDGE_CURVE ( 'NONE', #543, #1183, #1093, .T. ) ;
#1061 = CARTESIAN_POINT ( 'NONE',  ( 4.171811191128179885, 7.826365425634999262, 3.010496517392910132 ) ) ;
#1062 = CARTESIAN_POINT ( 'NONE',  ( 5.025373442975880067, 0.5518560262154910134, 0.0000000000000000000 ) ) ;
#1063 = CIRCLE ( 'NONE', #397, 0.4120849439305878104 ) ;
#1064 = ORIENTED_EDGE ( 'NONE', *, *, #467, .T. ) ;
#1065 = CARTESIAN_POINT ( 'NONE',  ( 1.643701232102960041, 7.326365425635000150, 1.973630027171440204 ) ) ;
#1066 = AXIS2_PLACEMENT_3D ( 'NONE', #692, #706, #882 ) ;
#1067 = DIRECTION ( 'NONE',  ( -0.0000000000000000000, -1.000000000000000000, -0.0000000000000000000 ) ) ;
#1068 = EDGE_CURVE ( 'NONE', #546, #1144, #938, .T. ) ;
#1069 = ORIENTED_EDGE ( 'NONE', *, *, #440, .F. ) ;
#1070 = CARTESIAN_POINT ( 'NONE',  ( 0.7968849502188032341, 0.5557657039520099707, 0.3000000000000000444 ) ) ;
#1071 = ORIENTED_EDGE ( 'NONE', *, *, #1110, .T. ) ;
#1072 = DIRECTION ( 'NONE',  ( -1.700923202363659940E-16, -1.000000000000000000, 0.0000000000000000000 ) ) ;
#1073 = ADVANCED_FACE ( 'NONE', ( #249 ), #1006, .T. ) ;
#1074 = SURFACE_STYLE_FILL_AREA ( #523 ) ;
#1075 = ORIENTED_EDGE ( 'NONE', *, *, #402, .F. ) ;
#1076 = PLANE ( 'NONE',  #20 ) ;
#1077 = DIRECTION ( 'NONE',  ( 0.0000000000000000000, 0.7071067811865474617, 0.7071067811865474617 ) ) ;
#1078 = FACE_OUTER_BOUND ( 'NONE', #696, .T. ) ;
#1079 = EDGE_LOOP ( 'NONE', ( #161, #415, #985, #1113 ) ) ;
#1080 = CARTESIAN_POINT ( 'NONE',  ( 5.325373442975880778, 3.871376290216600236, 1.897353801849632760E-16 ) ) ;
#1081 = CIRCLE ( 'NONE', #60, 0.4120849439305878104 ) ;
#1082 = STYLED_ITEM ( 'NONE', ( #15 ), #509 ) ;
#1083 = SURFACE_STYLE_FILL_AREA ( #714 ) ;
#1084 = AXIS2_PLACEMENT_3D ( 'NONE', #110, #580, #686 ) ;
#1085 = SURFACE_STYLE_USAGE ( .BOTH. , #50 ) ;
#1086 = PRESENTATION_LAYER_ASSIGNMENT (  '', '', ( #445 ) ) ;
#1087 = VERTEX_POINT ( 'NONE', #151 ) ;
#1088 = DIRECTION ( 'NONE',  ( 0.0000000000000000000, 1.000000000000000000, 0.0000000000000000000 ) ) ;
#1089 = EDGE_CURVE ( 'NONE', #1183, #837, #544, .T. ) ;
#1090 = DIRECTION ( 'NONE',  ( 0.0000000000000000000, 1.000000000000000000, 0.0000000000000000000 ) ) ;
#1091 = FACE_OUTER_BOUND ( 'NONE', #270, .T. ) ;
#1092 = ORIENTED_EDGE ( 'NONE', *, *, #1025, .F. ) ;
#1093 = LINE ( 'NONE', #178, #1103 ) ;
#1094 = ORIENTED_EDGE ( 'NONE', *, *, #500, .F. ) ;
#1095 = EDGE_CURVE ( 'NONE', #731, #879, #403, .T. ) ;
#1096 = FACE_OUTER_BOUND ( 'NONE', #684, .T. ) ;
#1097 = EDGE_LOOP ( 'NONE', ( #899, #303, #463, #319 ) ) ;
#1098 = DIRECTION ( 'NONE',  ( 0.0000000000000000000, 0.0000000000000000000, -1.000000000000000000 ) ) ;
#1099 = ORIENTED_EDGE ( 'NONE', *, *, #942, .T. ) ;
#1100 = VECTOR ( 'NONE', #649, 1000.000000000000000 ) ;
#1101 = CARTESIAN_POINT ( 'NONE',  ( 1.620000000000000107, 0.0000000000000000000, 2.587915056069412412 ) ) ;
#1102 = VECTOR ( 'NONE', #23, 1000.000000000000227 ) ;
#1103 = VECTOR ( 'NONE', #374, 1000.000000000000000 ) ;
#1104 = ADVANCED_FACE ( 'NONE', ( #640 ), #1202, .T. ) ;
#1105 = MECHANICAL_DESIGN_GEOMETRIC_PRESENTATION_REPRESENTATION (  '', ( #445 ), #1050 ) ;
#1106 = VERTEX_POINT ( 'NONE', #851 ) ;
#1107 = CARTESIAN_POINT ( 'NONE',  ( 0.0000000000000000000, 0.0000000000000000000, 0.0000000000000000000 ) ) ;
#1108 = ORIENTED_EDGE ( 'NONE', *, *, #588, .F. ) ;
#1109 = DIRECTION ( 'NONE',  ( -1.000000000000000000, 0.0000000000000000000, -0.0000000000000000000 ) ) ;
#1110 = EDGE_CURVE ( 'NONE', #879, #731, #260, .T. ) ;
#1111 = VERTEX_POINT ( 'NONE', #387 ) ;
#1112 = LINE ( 'NONE', #836, #835 ) ;
#1113 = ORIENTED_EDGE ( 'NONE', *, *, #467, .F. ) ;
#1114 = CARTESIAN_POINT ( 'NONE',  ( 1.643701232102960041, 7.826365425634999262, 3.010496517392910132 ) ) ;
#1115 = CARTESIAN_POINT ( 'NONE',  ( 5.799999999999999822, 7.826365425634999262, 1.571680007585128713 ) ) ;
#1116 = ORIENTED_EDGE ( 'NONE', *, *, #158, .F. ) ;
#1117 = PLANE ( 'NONE',  #499 ) ;
#1118 = CARTESIAN_POINT ( 'NONE',  ( 4.160000000000000142, 0.0000000000000000000, 3.000000000000000000 ) ) ;
#1119 = COLOUR_RGB ( '',0.9960784313725490335, 0.9960784313725490335, 1.000000000000000000 ) ;
#1120 = VECTOR ( 'NONE', #991, 1000.000000000000000 ) ;
#1121 = DIRECTION ( 'NONE',  ( -0.0000000000000000000, 0.0000000000000000000, -1.000000000000000000 ) ) ;
#1122 = PRESENTATION_LAYER_ASSIGNMENT (  '', '', ( #2 ) ) ;
#1123 = FILL_AREA_STYLE_COLOUR ( '', #958 ) ;
#1124 = ORIENTED_EDGE ( 'NONE', *, *, #149, .T. ) ;
#1125 = DIRECTION ( 'NONE',  ( -0.0000000000000000000, 1.000000000000000000, -0.0000000000000000000 ) ) ;
#1126 = ADVANCED_FACE ( 'NONE', ( #473 ), #19, .F. ) ;
#1127 = DIRECTION ( 'NONE',  ( 0.0000000000000000000, -1.000000000000000000, 0.0000000000000000000 ) ) ;
#1128 = DIRECTION ( 'NONE',  ( -0.0000000000000000000, 1.000000000000000000, -0.0000000000000000000 ) ) ;
#1129 = VERTEX_POINT ( 'NONE', #111 ) ;
#1130 = CARTESIAN_POINT ( 'NONE',  ( 5.025373442975880067, 0.5518560262154910134, 0.0000000000000000000 ) ) ;
#1131 = CARTESIAN_POINT ( 'NONE',  ( 5.025373442975880067, 0.5518560262154909024, 4.000000000000000000 ) ) ;
#1132 = EDGE_LOOP ( 'NONE', ( #1203, #375, #858, #592 ) ) ;
#1133 = DIRECTION ( 'NONE',  ( -6.894036102323711442E-17, -1.000000000000000000, 6.894036102323711442E-17 ) ) ;
#1134 = DIRECTION ( 'NONE',  ( 0.0000000000000000000, 0.0000000000000000000, 1.000000000000000000 ) ) ;
#1135 = ADVANCED_FACE ( 'NONE', ( #575 ), #292, .T. ) ;
#1136 = VECTOR ( 'NONE', #1001, 1000.000000000000000 ) ;
#1137 =( NAMED_UNIT ( * ) SI_UNIT ( $, .STERADIAN. ) SOLID_ANGLE_UNIT ( ) );
#1138 = MECHANICAL_DESIGN_GEOMETRIC_PRESENTATION_REPRESENTATION (  '', ( #236 ), #39 ) ;
#1139 = VECTOR ( 'NONE', #243, 1000.000000000000000 ) ;
#1140 = ORIENTED_EDGE ( 'NONE', *, *, #932, .F. ) ;
#1141 = CARTESIAN_POINT ( 'NONE',  ( 3.393578687218609780, 3.571376290216599969, 4.000000000000000000 ) ) ;
#1142 = DIRECTION ( 'NONE',  ( 0.0000000000000000000, -0.0000000000000000000, 1.000000000000000000 ) ) ;
#1143 = EDGE_CURVE ( 'NONE', #1014, #404, #379, .T. ) ;
#1144 = VERTEX_POINT ( 'NONE', #862 ) ;
#1145 = DIRECTION ( 'NONE',  ( -0.0000000000000000000, 0.2982749812279670842, 0.9544799817562733546 ) ) ;
#1146 = DIRECTION ( 'NONE',  ( 1.000000000000000000, -1.700923202363659940E-16, 0.0000000000000000000 ) ) ;
#1147 = DIRECTION ( 'NONE',  ( -0.0000000000000000000, 1.000000000000000000, -0.0000000000000000000 ) ) ;
#1148 = VERTEX_POINT ( 'NONE', #421 ) ;
#1149 = LINE ( 'NONE', #310, #853 ) ;
#1150 = EDGE_CURVE ( 'NONE', #142, #752, #591, .T. ) ;
#1151 = ORIENTED_EDGE ( 'NONE', *, *, #390, .T. ) ;
#1152 = LINE ( 'NONE', #1056, #912 ) ;
#1153 = VERTEX_POINT ( 'NONE', #904 ) ;
#1154 = AXIS2_PLACEMENT_3D ( 'NONE', #941, #89, #471 ) ;
#1155 = DIRECTION ( 'NONE',  ( -1.000000000000000000, 0.0000000000000000000, -0.0000000000000000000 ) ) ;
#1156 = AXIS2_PLACEMENT_3D ( 'NONE', #925, #825, #820 ) ;
#1157 = FACE_OUTER_BOUND ( 'NONE', #124, .T. ) ;
#1158 =( GEOMETRIC_REPRESENTATION_CONTEXT ( 3 ) GLOBAL_UNCERTAINTY_ASSIGNED_CONTEXT ( ( #674 ) ) GLOBAL_UNIT_ASSIGNED_CONTEXT ( ( #1057, #201, #1137 ) ) REPRESENTATION_CONTEXT ( 'NONE', 'WORKASPACE' ) );
#1159 = ADVANCED_FACE ( 'NONE', ( #1170 ), #805, .F. ) ;
#1160 = CARTESIAN_POINT ( 'NONE',  ( 0.0000000000000000000, 5.029886257090540269, 0.6996596599081911227 ) ) ;
#1161 = CARTESIAN_POINT ( 'NONE',  ( 0.0000000000000000000, 0.0000000000000000000, 0.0000000000000000000 ) ) ;
#1162 = ORIENTED_EDGE ( 'NONE', *, *, #578, .F. ) ;
#1163 = LINE ( 'NONE', #320, #915 ) ;
#1164 =( NAMED_UNIT ( * ) SI_UNIT ( $, .STERADIAN. ) SOLID_ANGLE_UNIT ( ) );
#1165 = PLANE ( 'NONE',  #951 ) ;
#1166 = ORIENTED_EDGE ( 'NONE', *, *, #759, .T. ) ;
#1167 = LINE ( 'NONE', #143, #137 ) ;
#1168 = CYLINDRICAL_SURFACE ( 'NONE', #993, 0.4120849439305878104 ) ;
#1169 = DIRECTION ( 'NONE',  ( -0.7071067811865480168, 0.0000000000000000000, -0.7071067811865470176 ) ) ;
#1170 = FACE_OUTER_BOUND ( 'NONE', #474, .T. ) ;
#1171 = EDGE_CURVE ( 'NONE', #712, #321, #324, .T. ) ;
#1172 = ORIENTED_EDGE ( 'NONE', *, *, #16, .F. ) ;
#1173 = DIRECTION ( 'NONE',  ( -0.5773502691896259531, -0.5773502691896259531, 0.5773502691896252870 ) ) ;
#1174 = AXIS2_PLACEMENT_3D ( 'NONE', #49, #627, #225 ) ;
#1175 = ORIENTED_EDGE ( 'NONE', *, *, #365, .F. ) ;
#1176 = UNCERTAINTY_MEASURE_WITH_UNIT (LENGTH_MEASURE( 1.000000000000000082E-05 ), #88, 'distance_accuracy_value', 'NONE');
#1177 = VECTOR ( 'NONE', #6, 1000.000000000000000 ) ;
#1178 = VECTOR ( 'NONE', #790, 1000.000000000000000 ) ;
#1179 = CARTESIAN_POINT ( 'NONE',  ( 0.7968849502188030121, 0.5557657039520099707, 0.0000000000000000000 ) ) ;
#1180 = ORIENTED_EDGE ( 'NONE', *, *, #1020, .T. ) ;
#1181 = EDGE_CURVE ( 'NONE', #847, #1014, #977, .T. ) ;
#1182 = DIRECTION ( 'NONE',  ( 0.0000000000000000000, 0.9546624573639053146, 0.2976904306488698526 ) ) ;
#1183 = VERTEX_POINT ( 'NONE', #1161 ) ;
#1184 = DIRECTION ( 'NONE',  ( 0.0000000000000000000, 0.0000000000000000000, -1.000000000000000000 ) ) ;
#1185 = DIRECTION ( 'NONE',  ( -0.7071067811865480168, 0.0000000000000000000, 0.7071067811865470176 ) ) ;
#1186 = CARTESIAN_POINT ( 'NONE',  ( 0.0000000000000000000, 7.826365425634999262, 1.571680007585130046 ) ) ;
#1187 = DIRECTION ( 'NONE',  ( 0.0000000000000000000, -0.0000000000000000000, 1.000000000000000000 ) ) ;
#1188 = ORIENTED_EDGE ( 'NONE', *, *, #1053, .T. ) ;
#1189 = EDGE_CURVE ( 'NONE', #842, #1111, #889, .T. ) ;
#1190 = DIRECTION ( 'NONE',  ( 0.0000000000000000000, 0.0000000000000000000, -1.000000000000000000 ) ) ;
#1191 = CARTESIAN_POINT ( 'NONE',  ( 0.0000000000000000000, 0.0000000000000000000, 0.0000000000000000000 ) ) ;
#1192 = EDGE_LOOP ( 'NONE', ( #830, #611 ) ) ;
#1193 = DIRECTION ( 'NONE',  ( 0.0000000000000000000, -1.000000000000000000, 0.0000000000000000000 ) ) ;
#1194 = ORIENTED_EDGE ( 'NONE', *, *, #330, .T. ) ;
#1195 =( NAMED_UNIT ( * ) SI_UNIT ( $, .STERADIAN. ) SOLID_ANGLE_UNIT ( ) );
#1196 = AXIS2_PLACEMENT_3D ( 'NONE', #1061, #700, #596 ) ;
#1197 = DIRECTION ( 'NONE',  ( 0.0000000000000000000, 0.0000000000000000000, -1.000000000000000000 ) ) ;
#1198 = EDGE_CURVE ( 'NONE', #978, #1048, #139, .T. ) ;
#1199 = AXIS2_PLACEMENT_3D ( 'NONE', #493, #391, #114 ) ;
#1200 = AXIS2_PLACEMENT_3D ( 'NONE', #29, #1125, #859 ) ;
#1201 = EDGE_LOOP ( 'NONE', ( #510, #808, #354, #312 ) ) ;
#1202 = CYLINDRICAL_SURFACE ( 'NONE', #65, 0.4120849439305878104 ) ;
#1203 = ORIENTED_EDGE ( 'NONE', *, *, #57, .F. ) ;
#1204 = DIRECTION ( 'NONE',  ( 0.0000000000000000000, -0.0000000000000000000, 1.000000000000000000 ) ) ;
#1205 = LINE ( 'NONE', #371, #971 ) ;
#1206 = EDGE_LOOP ( 'NONE', ( #918, #107, #282, #495 ) ) ;
#1207 = LINE ( 'NONE', #444, #259 ) ;
#1208 = ORIENTED_EDGE ( 'NONE', *, *, #69, .T. ) ;
#1209 = DIRECTION ( 'NONE',  ( 0.0000000000000000000, 0.0000000000000000000, -1.000000000000000000 ) ) ;
#1210 = CARTESIAN_POINT ( 'NONE',  ( 1.620000000000000107, -4.000000000000000000, 3.000000000000000000 ) ) ;
#1211 = DIRECTION ( 'NONE',  ( 0.0000000000000000000, 0.0000000000000000000, -1.000000000000000000 ) ) ;
#1212 = ADVANCED_FACE ( 'NONE', ( #317 ), #988, .F. ) ;
#1213 = EDGE_LOOP ( 'NONE', ( #70, #55, #638, #58 ) ) ;
#1214 = CARTESIAN_POINT ( 'NONE',  ( 0.0000000000000000000, 0.0000000000000000000, 0.0000000000000000000 ) ) ;
#1215 = STYLED_ITEM ( 'NONE', ( #247 ), #253 ) ;
#1216 = VECTOR ( 'NONE', #809, 999.9999999999998863 ) ;
#1217 = VECTOR ( 'NONE', #940, 1000.000000000000000 ) ;
ENDSEC;
END-ISO-10303-21;
