<mxfile host="app.diagrams.net" modified="2022-11-30T11:17:37.290Z" agent="5.0 (Windows NT 10.0; Win64; x64) AppleWebKit/537.36 (KHTML, like Gecko) Chrome/107.0.0.0 Safari/537.36" etag="K5y9H_lanq6Yc1Ckaz3T" version="20.6.0" type="gitlab">
  <diagram id="WTRqjcRJzdHD3JXi9NWl" name="Seite-1">
    <mxGraphModel dx="1182" dy="659" grid="1" gridSize="10" guides="1" tooltips="1" connect="1" arrows="1" fold="1" page="1" pageScale="1" pageWidth="826" pageHeight="1169" math="0" shadow="0">
      <root>
        <mxCell id="0" />
        <mxCell id="1" parent="0" />
        <mxCell id="u82ArXVwPc1J9cSTXgQD-1" value="Login" style="ellipse;whiteSpace=wrap;html=1;aspect=fixed;" parent="1" vertex="1">
          <mxGeometry x="373" y="183" width="80" height="80" as="geometry" />
        </mxCell>
        <mxCell id="u82ArXVwPc1J9cSTXgQD-2" value="Dashboard" style="rounded=1;whiteSpace=wrap;html=1;fillColor=#dae8fc;strokeColor=#6c8ebf;" parent="1" vertex="1">
          <mxGeometry x="353" y="313" width="120" height="60" as="geometry" />
        </mxCell>
        <mxCell id="u82ArXVwPc1J9cSTXgQD-3" value="Gruppen" style="rounded=1;whiteSpace=wrap;html=1;fillColor=#fff2cc;strokeColor=#d6b656;" parent="1" vertex="1">
          <mxGeometry x="353" y="433" width="120" height="60" as="geometry" />
        </mxCell>
        <mxCell id="u82ArXVwPc1J9cSTXgQD-4" value="TeilnehmerInnen + Fach + Raum + Gruppe + Tag" style="rounded=1;whiteSpace=wrap;html=1;fillColor=#e1d5e7;strokeColor=#9673a6;" parent="1" vertex="1">
          <mxGeometry x="353" y="553" width="120" height="60" as="geometry" />
        </mxCell>
        <mxCell id="u82ArXVwPc1J9cSTXgQD-5" value="Logout" style="ellipse;whiteSpace=wrap;html=1;aspect=fixed;" parent="1" vertex="1">
          <mxGeometry x="373" y="713" width="80" height="80" as="geometry" />
        </mxCell>
        <mxCell id="u82ArXVwPc1J9cSTXgQD-6" value="" style="endArrow=classic;html=1;rounded=0;" parent="1" edge="1">
          <mxGeometry width="50" height="50" relative="1" as="geometry">
            <mxPoint x="412" y="263" as="sourcePoint" />
            <mxPoint x="412" y="313" as="targetPoint" />
          </mxGeometry>
        </mxCell>
        <mxCell id="u82ArXVwPc1J9cSTXgQD-7" value="" style="endArrow=classic;html=1;rounded=0;" parent="1" edge="1">
          <mxGeometry width="50" height="50" relative="1" as="geometry">
            <mxPoint x="412" y="373" as="sourcePoint" />
            <mxPoint x="412" y="433" as="targetPoint" />
          </mxGeometry>
        </mxCell>
        <mxCell id="u82ArXVwPc1J9cSTXgQD-9" value="" style="endArrow=classic;html=1;rounded=0;entryX=0.5;entryY=0;entryDx=0;entryDy=0;" parent="1" target="u82ArXVwPc1J9cSTXgQD-4" edge="1">
          <mxGeometry width="50" height="50" relative="1" as="geometry">
            <mxPoint x="413" y="493" as="sourcePoint" />
            <mxPoint x="413" y="543" as="targetPoint" />
          </mxGeometry>
        </mxCell>
        <mxCell id="u82ArXVwPc1J9cSTXgQD-10" value="" style="endArrow=classic;html=1;rounded=0;entryX=0.5;entryY=0;entryDx=0;entryDy=0;" parent="1" target="u82ArXVwPc1J9cSTXgQD-5" edge="1">
          <mxGeometry width="50" height="50" relative="1" as="geometry">
            <mxPoint x="413" y="613" as="sourcePoint" />
            <mxPoint x="413" y="673" as="targetPoint" />
          </mxGeometry>
        </mxCell>
        <mxCell id="u82ArXVwPc1J9cSTXgQD-11" value="&lt;font style=&quot;font-size: 20px;&quot;&gt;TrainerInnen Aktivitätsdiagramm&lt;/font&gt;" style="text;html=1;strokeColor=none;fillColor=none;align=center;verticalAlign=middle;whiteSpace=wrap;rounded=0;" parent="1" vertex="1">
          <mxGeometry x="20" y="10" width="250" height="160" as="geometry" />
        </mxCell>
      </root>
    </mxGraphModel>
  </diagram>
</mxfile>
