{
  "data": [
    {
      "url": "dou.ua",
      "resolutions": [
        { "width": "1920", "height": "1080" },
        { "width": "1024", "height": "2000" },
        { "width": "600", "height": "2000" }
      ]
    },
    {
      "url": "ain.ua",
      "resolutions": [
        { "width": "1920", "height": "1080" },
        { "width": "1024", "height": "2000" },
        { "width": "600", "height": "2000" },
        { "width": "320", "height": "2000" }
      ]
    },
    {
      "url": "https://viseven.com",
      "resolutions": [
        { "width": "1920", "height": "1080" },
        { "width": "1024", "height": "2000" },
        { "width": "600", "height": "2000" },
        { "width": "320", "height": "2000" }
      ]
    }
  ]
}
