<?xml version="1.0" encoding="UTF-8"?>
<svg xmlns="http://www.w3.org/2000/svg" xmlns:xlink="http://www.w3.org/1999/xlink" viewBox="0 0 240.96 156">
  <defs>
    <style>
      .cls-1 {
        fill: none;
      }

      .cls-2 {
        clip-path: url(#clippath);
      }

      .cls-3 {
        fill: #008d39;
      }

      .cls-4 {
        fill: #009640;
      }

      .cls-5 {
        fill: #fff;
      }

      .cls-6 {
        fill: #1d1d1b;
      }

      .cls-7 {
        clip-path: url(#clippath-1);
      }
    </style>
    <clipPath id="clippath">
      <rect class="cls-1" x="-264.57" y="0" width="240.96" height="156"/>
    </clipPath>
    <clipPath id="clippath-1">
      <rect class="cls-1" x="0" y=".25" width="240.96" height="155.81" rx="13.9" ry="13.9"/>
    </clipPath>
  </defs>
  <g id="verso">
    <g class="cls-2">
      <path class="cls-3" d="M-28.63,63.82l-1.34,2.09-17.97-26.97c-.08,.01-.16,.01-.24,.01-1.5,0-2.7-1.21-2.7-2.7s1.21-2.7,2.7-2.7,2.7,1.22,2.7,2.7c0,.57-.17,1.09-.46,1.52l17.31,26.06ZM6.34,44.9c0-1.92-1.57-3.49-3.49-3.49s-3.47,1.57-3.47,3.49c0,.76,.25,1.48,.69,2.07l-16.02,24.38-5.69-8.7,11.64-17.72c.08,.01,.17,.01,.25,.01,1.92,0,3.47-1.57,3.47-3.49s-1.56-3.49-3.47-3.49-3.49,1.57-3.49,3.49c0,.78,.25,1.52,.71,2.11l-10.82,16.49-10.8-16.49c.46-.59,.71-1.33,.71-2.11,0-1.92-1.56-3.49-3.47-3.49s-3.49,1.57-3.49,3.49,1.57,3.49,3.49,3.49c.08,0,.16,0,.24-.01l11.6,17.72-5.96,9.08-16.24-24.81c.41-.58,.65-1.29,.65-2.03,0-1.92-1.57-3.49-3.49-3.49s-3.47,1.57-3.47,3.49c0,2.04,1.79,3.69,3.84,3.46l17.02,25.96-14.6,22.53c-.14-.02-.3-.04-.45-.04-.86,.01-1.76,.34-2.36,.98-.64,.6-1,1.47-1,2.38s.35,1.74,.98,2.38c1.28,1.28,3.52,1.23,4.72,0,.63-.63,.98-1.47,.98-2.36,0-.63-.16-1.22-.48-1.75l13.92-21.49,5.69,8.68-10.54,16.15c-1.04-.14-2.12,.23-2.82,.94-.63,.6-.99,1.47-.99,2.38s.35,1.75,.95,2.36c.63,.64,1.5,1,2.39,1s1.74-.35,2.36-.98c.61-.62,.98-1.48,.98-2.38,0-.62-.18-1.23-.49-1.76l9.83-15.07,9.24,15.02c-.33,.53-.49,1.15-.49,1.75-.02,.89,.33,1.76,.97,2.4,1.27,1.27,3.51,1.25,4.74,.01,.63-.62,.99-1.48,.99-2.39s-.36-1.75-.97-2.36c-.75-.75-1.81-1.11-2.83-.96l-9.92-16.09,5.93-9.05L-2.43,98.67c-.33,.52-.51,1.12-.52,1.77,0,.89,.36,1.77,.98,2.36,1.25,1.29,3.47,1.29,4.74,.02,.63-.63,.99-1.5,.99-2.38s-.36-1.77-.98-2.39c-.62-.62-1.48-.98-2.33-.98-.17,0-.34,0-.49,.02l-14.22-23.12L2.57,48.38c2.01,.17,3.78-1.46,3.78-3.47Zm-29.95,38.13l-5.69-8.71,5.96-9.07,5.69,8.71-5.96,9.07ZM3.75,36.24c0,1.5-1.22,2.7-2.7,2.7-.11,0-.2-.01-.31-.02l-17.38,27.7-1.41-2.11L-1.23,37.7c-.27-.42-.42-.93-.42-1.46,0-1.48,1.21-2.7,2.7-2.7s2.7,1.22,2.7,2.7ZM1.24,108.62c0,1.5-1.21,2.7-2.7,2.7s-2.7-1.21-2.7-2.7c0-.51,.14-.99,.4-1.4l-14.77-23.03,1.36-2.11L-1.85,105.95c.13-.02,.25-.04,.39-.04,1.5,0,2.7,1.22,2.7,2.7Zm-44.73-1.56c.31,.45,.49,.98,.49,1.56,0,1.5-1.21,2.7-2.7,2.7s-2.7-1.21-2.7-2.7,1.21-2.7,2.7-2.7c.06,0,.13,0,.19,.01l15.29-23.97,1.5,1.98-14.77,23.13Z"/>
    </g>
  </g>
  <g id="recto">
    <g class="cls-7">
      <rect class="cls-6" x="0" y=".06" width="240.96" height="156"/>
      <g>
        <path class="cls-4" d="M134.08,77.24c0-.42-.05-.83,.02-1.21,.04-.21,.25-.46,.44-.57,.38-.22,.8-.38,1.23-.52,.57-.18,.92-.61,1.27-1.05,.22-.28,.11-.53-.23-.63-.27-.08-.54-.17-.78-.31-.35-.2-.53-.53-.46-.95,.09-.52,.1-1.09,.32-1.55,.24-.5,.41-1.08,.93-1.42,.49-.31,1.03-.37,1.59-.33,.78,.06,1.37,.39,1.67,1.18,.12,.33,.32,.6,.36,.99,.03,.27,.16,.57,.22,.88,.13,.66-.05,1.06-.66,1.33-.17,.08-.35,.12-.53,.17-.35,.1-.46,.35-.24,.63,.35,.44,.7,.86,1.27,1.05,.41,.13,.81,.31,1.2,.49,.34,.15,.53,.4,.5,.8-.02,.33,0,.65,0,1.01h-8.1Z"/>
        <path class="cls-4" d="M145.44,72.97h-.26c0,1.95-.79,3.71-2.07,4.99-1.28,1.28-3.04,2.07-4.99,2.07-1.95,0-3.71-.79-4.99-2.07-1.28-1.28-2.07-3.04-2.07-4.99,0-1.95,.79-3.71,2.07-4.99,1.28-1.28,3.04-2.07,4.99-2.07,1.95,0,3.71,.79,4.99,2.07,1.28,1.28,2.07,3.04,2.07,4.99h.52c0-4.19-3.39-7.58-7.58-7.58-4.19,0-7.58,3.39-7.58,7.58,0,4.19,3.39,7.58,7.58,7.58,4.19,0,7.58-3.39,7.58-7.58h-.26Z"/>
        <path class="cls-4" d="M230.83,134.16c.62,0,1.12,.5,1.12,1.13,0,.27-.1,.52-.26,.72l8.15,12.27-.53,.36-8.15-12.27c-.1,.03-.22,.05-.33,.05-.62,0-1.12-.5-1.12-1.12s.5-1.13,1.12-1.13Z"/>
        <path class="cls-4" d="M236.97,139.61c.19-.19,.45-.3,.73-.3,.28,0,.55,.12,.73,.3,.19,.19,.3,.45,.3,.74,0,.29-.12,.55-.3,.74l-.08,.07,16.23,24.66-.18,.12-16.23-24.66c-.14,.08-.31,.12-.48,.12-.28,0-.55-.12-.73-.3-.19-.19-.3-.45-.3-.74,0-.29,.12-.55,.3-.74Z"/>
        <path class="cls-4" d="M229.56,139.61c.19-.19,.45-.3,.73-.3,.28,0,.55,.12,.73,.3,.19,.19,.3,.45,.3,.74s-.12,.55-.3,.74l-.08,.07,17.44,26.5-.18,.12-17.44-26.5c-.14,.08-.31,.12-.48,.12-.28,0-.55-.12-.73-.3-.19-.19-.3-.45-.3-.74,0-.29,.12-.55,.3-.74Z"/>
        <path class="cls-4" d="M247.12,139.61c-.19-.19-.45-.3-.73-.3-.28,0-.54,.12-.73,.3-.19,.19-.3,.45-.3,.74,0,.29,.12,.55,.3,.74l.08,.07-16.05,24.54,.18,.12,16.06-24.54c.14,.08,.31,.12,.48,.12,.28,0,.54-.12,.73-.3,.19-.19,.3-.45,.3-.74,0-.29-.12-.55-.3-.74Z"/>
        <path class="cls-4" d="M254.27,139.61c-.19-.19-.45-.3-.73-.3-.28,0-.54,.12-.73,.3-.19,.19-.3,.45-.3,.74,0,.29,.12,.55,.3,.74l.08,.07-17.34,26.5,.18,.12,17.34-26.5c.14,.08,.31,.12,.48,.12,.28,0,.54-.12,.73-.3,.19-.19,.3-.45,.3-.74,0-.29-.12-.55-.3-.74Z"/>
        <path class="cls-4" d="M268.05,153.15h-.26c0,6.93-2.81,13.21-7.35,17.75-4.54,4.54-10.82,7.35-17.75,7.35-6.93,0-13.21-2.81-17.75-7.35-4.54-4.54-7.35-10.82-7.35-17.75,0-6.93,2.81-13.21,7.35-17.75,4.54-4.54,10.82-7.35,17.75-7.35,6.93,0,13.21,2.81,17.75,7.35,4.54,4.54,7.35,10.82,7.35,17.75h.52c0-14.15-11.47-25.62-25.62-25.62-14.15,0-25.62,11.47-25.62,25.62,0,14.15,11.47,25.62,25.62,25.62,14.15,0,25.62-11.47,25.62-25.62h-.26Z"/>
        <path class="cls-4" d="M172.99,129.01h-9.15c.02-.47,.01-.93,.08-1.39,.06-.4,.35-.67,.7-.87,.59-.33,1.19-.66,1.75-1.04,.3-.2,.53-.51,.77-.79,.06-.07,.09-.21,.07-.29-.13-.42-.09-.9-.52-1.2-.28-.2-.36-.82-.2-1.16,.02-.05,.05-.12,.03-.16-.23-.51-.07-1.03,.02-1.52,.08-.41,.35-.76,.81-.96,.76-.32,1.49-.36,2.19,.07,.25,.15,.46,.44,.57,.71,.22,.53,.38,1.07,.23,1.67-.07,.26,.07,.56,.04,.83-.02,.19-.14,.41-.29,.53-.61,.51-.6,1.62,.06,2.06,.64,.43,1.31,.82,1.99,1.19,.56,.31,.85,.75,.85,1.39v.92Z"/>
        <path class="cls-4" d="M175.72,124.85h-.26c0,1.95-.79,3.71-2.07,4.99-1.28,1.28-3.04,2.07-4.99,2.07-1.95,0-3.71-.79-4.99-2.07-1.28-1.28-2.07-3.04-2.07-4.99,0-1.95,.79-3.71,2.07-4.99,1.28-1.28,3.04-2.07,4.99-2.07,1.95,0,3.71,.79,4.99,2.07,1.28,1.28,2.07,3.04,2.07,4.99h.52c0-4.19-3.39-7.58-7.58-7.58-4.19,0-7.58,3.39-7.58,7.58,0,4.19,3.39,7.58,7.58,7.58,4.19,0,7.58-3.39,7.58-7.58h-.26Z"/>
        <path class="cls-4" d="M190.79,156.58c0-.42-.05-.83,.02-1.21,.04-.21,.25-.45,.44-.57,.38-.22,.8-.38,1.23-.52,.57-.18,.92-.61,1.27-1.05,.22-.28,.11-.53-.23-.63-.27-.08-.54-.17-.78-.31-.35-.2-.53-.53-.46-.95,.09-.52,.1-1.09,.32-1.55,.24-.5,.41-1.08,.93-1.42,.49-.31,1.03-.37,1.59-.33,.78,.06,1.37,.39,1.67,1.18,.12,.33,.32,.6,.36,.99,.03,.27,.16,.57,.22,.88,.13,.66-.05,1.06-.66,1.33-.17,.08-.35,.12-.53,.17-.35,.1-.46,.35-.24,.63,.35,.44,.7,.86,1.27,1.05,.41,.13,.81,.31,1.2,.49,.34,.15,.53,.4,.5,.8-.02,.33,0,.65,0,1.01h-8.1Z"/>
        <path class="cls-4" d="M202.16,152.31h-.26c0,1.95-.79,3.71-2.07,4.99-1.28,1.28-3.04,2.07-4.99,2.07-1.95,0-3.71-.79-4.99-2.07-1.28-1.28-2.07-3.04-2.07-4.99,0-1.95,.79-3.71,2.07-4.99,1.28-1.28,3.04-2.07,4.99-2.07,1.95,0,3.71,.79,4.99,2.07,1.28,1.28,2.07,3.04,2.07,4.99h.52c0-4.19-3.39-7.58-7.58-7.58-4.19,0-7.58,3.39-7.58,7.58,0,4.19,3.39,7.58,7.58,7.58,4.19,0,7.58-3.39,7.58-7.58h-.26Z"/>
        <path class="cls-4" d="M124.67,140.6c0-.42-.05-.83,.02-1.21,.04-.21,.25-.45,.44-.57,.38-.22,.8-.38,1.23-.52,.57-.18,.92-.61,1.27-1.05,.22-.28,.11-.53-.23-.63-.27-.08-.54-.17-.78-.31-.35-.2-.53-.53-.47-.95,.09-.52,.1-1.09,.32-1.55,.24-.5,.41-1.08,.93-1.42,.49-.31,1.03-.37,1.59-.33,.78,.06,1.37,.39,1.67,1.18,.12,.33,.32,.6,.36,.99,.03,.27,.16,.57,.22,.88,.13,.66-.05,1.06-.66,1.33-.17,.08-.35,.12-.53,.17-.35,.1-.46,.35-.24,.63,.35,.44,.7,.86,1.27,1.05,.41,.13,.81,.31,1.2,.49,.34,.15,.53,.4,.5,.8-.02,.33,0,.65,0,1.01h-8.1Z"/>
        <path class="cls-4" d="M136.03,136.33h-.26c0,1.95-.79,3.71-2.07,4.99-1.28,1.28-3.04,2.07-4.99,2.07-1.95,0-3.71-.79-4.99-2.07-1.28-1.28-2.07-3.04-2.07-4.99,0-1.95,.79-3.71,2.07-4.99,1.28-1.28,3.04-2.07,4.99-2.07,1.95,0,3.71,.79,4.99,2.07,1.28,1.28,2.07,3.04,2.07,4.99h.52c0-4.19-3.39-7.58-7.58-7.58-4.19,0-7.58,3.39-7.58,7.58,0,4.19,3.39,7.58,7.58,7.58,4.19,0,7.58-3.39,7.58-7.58h-.26Z"/>
        <path class="cls-4" d="M89.24,156.13c0-.42-.05-.83,.02-1.21,.04-.21,.25-.46,.44-.57,.38-.22,.8-.38,1.23-.52,.57-.18,.92-.61,1.27-1.05,.22-.27,.11-.53-.23-.63-.27-.08-.54-.17-.78-.31-.35-.2-.53-.53-.46-.95,.09-.52,.1-1.09,.32-1.55,.24-.5,.41-1.08,.93-1.42,.49-.31,1.03-.37,1.59-.33,.78,.06,1.37,.39,1.67,1.18,.12,.33,.32,.6,.36,.99,.03,.27,.16,.58,.22,.88,.13,.66-.05,1.06-.66,1.33-.17,.08-.35,.12-.53,.17-.35,.1-.46,.35-.24,.63,.35,.44,.7,.86,1.27,1.05,.41,.13,.81,.31,1.2,.49,.34,.15,.53,.4,.5,.8-.02,.32,0,.65,0,1.01h-8.1Z"/>
        <path class="cls-4" d="M100.6,151.85h-.26c0,1.95-.79,3.71-2.07,4.99-1.28,1.28-3.04,2.07-4.99,2.07-1.95,0-3.71-.79-4.99-2.07-1.28-1.28-2.07-3.04-2.07-4.99,0-1.95,.79-3.71,2.07-4.99,1.28-1.28,3.04-2.07,4.99-2.07,1.95,0,3.71,.79,4.99,2.07,1.28,1.28,2.07,3.04,2.07,4.99h.52c0-4.19-3.39-7.58-7.58-7.58-4.19,0-7.58,3.39-7.58,7.58,0,4.19,3.39,7.58,7.58,7.58,4.19,0,7.58-3.39,7.58-7.58h-.26Z"/>
        <path class="cls-4" d="M73.96,101.68c-.03,.09-.05,.18-.06,.22,.18,.07,.36,.09,.48,.19,.73,.62,1.09,1.39,.96,2.36-.01,.11,.03,.24,.09,.33,.16,.24-.03,.97-.29,1.11-.09,.05-.2,.13-.23,.23-.31,.8-.2,1.26,.42,1.68,.62,.42,1.27,.79,1.93,1.15,.56,.31,.86,.74,.84,1.38,0,.3,0,.6,0,.92h-9.15c.03-.49,.03-.98,.11-1.46,.06-.37,.35-.62,.69-.8,.58-.33,1.17-.64,1.72-1.01,.3-.2,.58-.47,.79-.77,.11-.16,.12-.46,.07-.66-.08-.28-.13-.59-.48-.75-.35-.16-.45-.74-.24-1.06,.04-.06,.05-.15,.04-.22-.02-.2-.07-.39-.08-.59-.02-.34,0-.66,.28-.94,.23-.22,.38-.52,.6-.75,.11-.11,.28-.17,.42-.24,.22-.1,.43-.21,.66-.28,.12-.04,.27,0,.42,0Z"/>
        <path class="cls-4" d="M80.86,106.45h-.26c0,1.95-.79,3.71-2.07,4.99-1.28,1.28-3.04,2.07-4.99,2.07-1.95,0-3.71-.79-4.99-2.07-1.28-1.28-2.07-3.04-2.07-4.99,0-1.95,.79-3.71,2.07-4.99,1.28-1.28,3.04-2.07,4.99-2.07,1.95,0,3.71,.79,4.99,2.07,1.28,1.28,2.07,3.04,2.07,4.99h.52c0-4.19-3.39-7.58-7.58-7.58-4.19,0-7.58,3.39-7.58,7.58,0,4.19,3.39,7.58,7.58,7.58,4.19,0,7.58-3.39,7.58-7.58h-.26Z"/>
        <polygon class="cls-4" points="187.53 152.05 166.72 151.71 154.73 164.53 155.11 164.89 166.95 152.24 187.52 152.57 187.53 152.05 187.53 152.05"/>
        <polygon class="cls-4" points="195.08 144.89 186.29 124.59 175.72 124.59 175.72 125.11 185.95 125.11 194.6 145.09 195.08 144.89 195.08 144.89"/>
        <polygon class="cls-4" points="161.08 124.59 153.6 124.59 135.23 132.97 135.44 133.44 153.72 125.11 161.08 125.11 161.08 124.59 161.08 124.59"/>
        <polyline class="cls-4" points="217.32 151.38 202.18 151.64 202.19 152.16 217.33 151.9"/>
        <polygon class="cls-4" points="168.58 117.35 157.92 106.17 80.77 106.17 80.77 106.69 157.7 106.69 168.21 117.71 168.58 117.35 168.58 117.35"/>
        <polyline class="cls-4" points="166.84 151.72 100.73 151.72 100.73 152.24 166.84 152.24"/>
        <path class="cls-4" d="M234.81,110.23h.26c0-1.95,.79-3.71,2.07-4.99,1.28-1.28,3.04-2.07,4.99-2.07,1.95,0,3.71,.79,4.99,2.07,1.28,1.28,2.07,3.04,2.07,4.99,0,1.95-.79,3.71-2.07,4.99-1.28,1.28-3.04,2.07-4.99,2.07-1.95,0-3.71-.79-4.99-2.07-1.28-1.28-2.07-3.04-2.07-4.99h-.52c0,4.19,3.39,7.58,7.58,7.58,4.19,0,7.58-3.39,7.58-7.58,0-4.19-3.39-7.58-7.58-7.58-4.19,0-7.58,3.39-7.58,7.58h.26Z"/>
        <path class="cls-4" d="M244.23,77.33h-9.15c.02-.47,.01-.93,.08-1.39,.06-.4,.35-.67,.7-.87,.59-.33,1.19-.66,1.75-1.04,.3-.2,.53-.51,.77-.78,.06-.07,.09-.21,.07-.29-.13-.42-.09-.9-.52-1.2-.28-.2-.36-.82-.2-1.16,.02-.05,.05-.12,.03-.16-.23-.51-.07-1.03,.02-1.52,.08-.41,.35-.76,.81-.96,.76-.32,1.49-.36,2.19,.06,.25,.15,.46,.44,.57,.71,.22,.53,.38,1.07,.23,1.67-.07,.26,.07,.56,.04,.83-.02,.19-.14,.41-.29,.53-.61,.51-.6,1.62,.06,2.06,.64,.43,1.31,.82,1.99,1.19,.56,.31,.85,.75,.85,1.39v.92Z"/>
        <path class="cls-4" d="M237.63,115.2c3.05-.04,6.06-.09,9.15-.13-.03-.47-.03-.93-.1-1.38-.06-.4-.36-.67-.72-.86-.6-.33-1.2-.64-1.77-1.01-.3-.2-.54-.5-.78-.77-.06-.07-.1-.21-.07-.29,.12-.42,.07-.9,.5-1.21,.28-.2,.35-.83,.19-1.16-.02-.05-.05-.12-.03-.16,.22-.51,.06-1.03-.04-1.52-.09-.41-.36-.76-.82-.95-.76-.31-1.5-.34-2.19,.1-.24,.15-.45,.45-.56,.72-.21,.53-.37,1.07-.21,1.67,.07,.26-.06,.56-.02,.83,.03,.19,.15,.41,.3,.53,.62,.51,.63,1.61-.03,2.06-.64,.44-1.3,.84-1.97,1.22-.56,.32-.84,.76-.83,1.4,0,.29,0,.58,.01,.92Z"/>
        <path class="cls-4" d="M246.95,73.01h.26c0-4.19-3.39-7.58-7.58-7.58-4.19,0-7.58,3.39-7.58,7.58,0,4.19,3.39,7.58,7.58,7.58,4.19,0,7.58-3.39,7.58-7.58h-.52c0,1.95-.79,3.71-2.07,4.99-1.28,1.28-3.04,2.07-4.99,2.07-1.95,0-3.71-.79-4.99-2.07-1.28-1.28-2.07-3.04-2.07-4.99,0-1.95,.79-3.71,2.07-4.99,1.28-1.28,3.04-2.07,4.99-2.07,1.95,0,3.71,.79,4.99,2.07,1.28,1.28,2.07,3.04,2.07,4.99h.26Z"/>
        <path class="cls-4" d="M226.58,21.07c-.03,.09-.05,.18-.06,.22,.18,.07,.36,.09,.48,.19,.73,.61,1.09,1.38,.96,2.35-.01,.1,.03,.23,.09,.33,.16,.24-.03,.97-.29,1.1-.09,.05-.2,.13-.24,.22-.31,.79-.2,1.25,.42,1.67,.62,.41,1.27,.79,1.93,1.15,.56,.3,.86,.74,.84,1.38,0,.3,0,.6,0,.92h-9.15c.03-.49,.03-.98,.11-1.45,.06-.37,.35-.61,.69-.8,.58-.33,1.17-.64,1.72-1.01,.3-.2,.58-.47,.79-.77,.11-.16,.12-.46,.07-.66-.08-.28-.13-.58-.48-.74-.35-.16-.45-.74-.24-1.06,.04-.06,.05-.15,.04-.22-.02-.2-.07-.39-.08-.59-.02-.34,0-.66,.28-.93,.23-.22,.38-.51,.6-.75,.11-.11,.28-.17,.42-.24,.22-.1,.43-.21,.66-.28,.12-.04,.27,0,.42,0Z"/>
        <path class="cls-4" d="M233.47,25.82h.26c0-4.19-3.39-7.58-7.58-7.58-4.19,0-7.58,3.39-7.58,7.58,0,4.19,3.39,7.58,7.58,7.58,4.19,0,7.58-3.39,7.58-7.58h-.52c0,1.95-.79,3.71-2.07,4.99-1.28,1.28-3.04,2.07-4.99,2.07-1.95,0-3.71-.79-4.99-2.07-1.28-1.28-2.07-3.04-2.07-4.99,0-1.95,.79-3.71,2.07-4.99,1.28-1.28,3.04-2.07,4.99-2.07,1.95,0,3.71,.79,4.99,2.07,1.28,1.28,2.07,3.04,2.07,4.99h.26Z"/>
        <path class="cls-4" d="M195.9,65.78c0-.42-.05-.83,.02-1.21,.04-.21,.25-.45,.44-.57,.38-.22,.8-.38,1.23-.52,.57-.18,.92-.61,1.27-1.04,.22-.27,.11-.52-.23-.63-.27-.08-.54-.17-.78-.3-.35-.2-.53-.53-.46-.94,.09-.52,.1-1.08,.32-1.55,.24-.5,.41-1.08,.93-1.41,.49-.31,1.03-.37,1.59-.33,.78,.06,1.37,.39,1.67,1.18,.12,.33,.32,.6,.36,.99,.03,.27,.16,.57,.22,.88,.13,.66-.05,1.06-.66,1.33-.17,.08-.35,.12-.53,.17-.35,.1-.46,.35-.24,.63,.35,.44,.7,.86,1.27,1.05,.41,.13,.81,.31,1.2,.49,.34,.15,.53,.4,.5,.8-.02,.32,0,.65,0,1h-8.1Z"/>
        <path class="cls-4" d="M207.27,61.52h.26c0-4.19-3.39-7.58-7.58-7.58-4.19,0-7.58,3.39-7.58,7.58,0,4.19,3.39,7.58,7.58,7.58,4.19,0,7.58-3.39,7.58-7.58h-.52c0,1.95-.79,3.71-2.07,4.99-1.28,1.28-3.04,2.07-4.99,2.07-1.95,0-3.71-.79-4.99-2.07-1.28-1.28-2.07-3.04-2.07-4.99,0-1.95,.79-3.71,2.07-4.99,1.28-1.28,3.04-2.07,4.99-2.07,1.95,0,3.71,.79,4.99,2.07,1.28,1.28,2.07,3.04,2.07,4.99h.26Z"/>
        <path class="cls-4" d="M160.47,50.2c0-.42-.05-.82,.02-1.19,.04-.21,.25-.45,.44-.56,.38-.21,.8-.38,1.23-.51,.57-.18,.92-.6,1.27-1.03,.22-.27,.11-.52-.23-.62-.27-.08-.54-.17-.78-.3-.35-.2-.53-.52-.46-.93,.09-.52,.1-1.07,.32-1.53,.24-.49,.41-1.07,.93-1.39,.49-.31,1.03-.37,1.59-.32,.78,.06,1.37,.39,1.67,1.16,.12,.32,.32,.59,.36,.98,.03,.26,.16,.57,.22,.86,.13,.65-.05,1.04-.66,1.31-.17,.07-.35,.12-.53,.17-.35,.1-.46,.35-.24,.62,.35,.43,.7,.85,1.27,1.03,.41,.13,.81,.31,1.2,.48,.34,.15,.53,.4,.5,.79-.02,.32,0,.64,0,.99h-8.1Z"/>
        <path class="cls-4" d="M171.84,46h.26c0-4.19-3.39-7.58-7.58-7.58-4.19,0-7.58,3.39-7.58,7.58,0,4.19,3.39,7.58,7.58,7.58,4.19,0,7.58-3.39,7.58-7.58h-.52c0,1.95-.79,3.71-2.07,4.99-1.28,1.28-3.04,2.07-4.99,2.07-1.95,0-3.71-.79-4.99-2.07-1.28-1.28-2.07-3.04-2.07-4.99,0-1.95,.79-3.71,2.07-4.99,1.28-1.28,3.04-2.07,4.99-2.07,1.95,0,3.71,.79,4.99,2.07,1.28,1.28,2.07,3.04,2.07,4.99h.26Z"/>
        <path class="cls-4" d="M189.29,86.65c-.03,.09-.05,.18-.06,.22,.18,.07,.36,.09,.48,.19,.73,.61,1.09,1.38,.96,2.35-.01,.1,.03,.23,.09,.33,.16,.24-.03,.97-.29,1.1-.09,.05-.2,.13-.23,.22-.31,.79-.2,1.25,.42,1.67,.62,.41,1.27,.79,1.93,1.15,.56,.3,.86,.73,.84,1.38,0,.3,0,.6,0,.92h-9.15c.03-.49,.03-.98,.11-1.45,.06-.37,.35-.61,.69-.8,.58-.33,1.17-.64,1.72-1.01,.3-.2,.58-.47,.79-.77,.11-.16,.12-.46,.07-.66-.08-.28-.13-.58-.48-.74-.35-.16-.45-.74-.24-1.06,.04-.06,.05-.15,.04-.22-.02-.2-.07-.39-.08-.59-.02-.34,0-.66,.28-.93,.23-.22,.38-.51,.6-.75,.11-.11,.28-.17,.42-.24,.22-.1,.43-.21,.66-.28,.12-.04,.27,0,.42,0Z"/>
        <path class="cls-4" d="M196.18,91.4h.26c0-4.19-3.39-7.58-7.58-7.58-4.19,0-7.58,3.39-7.58,7.58,0,4.19,3.39,7.58,7.58,7.58,4.19,0,7.58-3.39,7.58-7.58h-.52c0,1.95-.79,3.71-2.07,4.99-1.28,1.28-3.04,2.07-4.99,2.07-1.95,0-3.71-.79-4.99-2.07-1.28-1.28-2.07-3.04-2.07-4.99,0-1.95,.79-3.71,2.07-4.99,1.28-1.28,3.04-2.07,4.99-2.07,1.95,0,3.71,.79,4.99,2.07,1.28,1.28,2.07,3.04,2.07,4.99h.26Z"/>
        <polygon class="cls-4" points="258.76 45.28 238.18 45.62 226.34 32.96 225.96 33.32 237.96 46.14 258.77 45.8 258.76 45.28 258.76 45.28"/>
        <polygon class="cls-4" points="232.31 72.75 224.95 72.75 206.68 64.41 206.46 64.89 224.84 73.27 232.31 73.27 232.31 72.75 232.31 72.75"/>
        <polygon class="cls-4" points="239.72 80.14 228.93 91.16 196.42 91.16 196.42 91.68 229.15 91.68 240.09 80.51 239.72 80.14 239.72 80.14"/>
        <polyline class="cls-4" points="238.07 45.62 171.97 45.62 171.97 46.14 238.07 46.14"/>
        <polyline class="cls-4" points="298.63 25.34 233.4 25.34 233.4 25.86 298.63 25.86"/>
        <polygon class="cls-4" points="234.78 109.97 218.68 109.97 208.32 91.3 207.86 91.55 218.37 110.49 234.78 110.49 234.78 109.97 234.78 109.97"/>
        <polygon class="cls-4" points="181.54 91.14 150.44 91.14 138.31 80.13 137.96 80.52 150.24 91.66 181.54 91.66 181.54 91.14 181.54 91.14"/>
        <polygon class="cls-4" points="203.56 119.36 204.98 117.99 204.54 117.54 202.66 119.36 204.48 121.25 204.94 120.8 203.56 119.36"/>
        <polygon class="cls-4" points="205.39 119.36 206.81 117.99 206.38 117.54 204.49 119.36 206.31 121.25 206.78 120.8 205.39 119.36"/>
        <polygon class="cls-4" points="207.22 119.36 208.64 117.99 208.21 117.54 206.33 119.36 208.15 121.25 208.61 120.8 207.22 119.36"/>
        <polygon class="cls-4" points="209.06 119.36 210.48 117.99 210.04 117.54 208.16 119.36 209.98 121.25 210.44 120.8 209.06 119.36"/>
        <polygon class="cls-4" points="152.41 144.96 153.84 143.59 153.4 143.14 151.52 144.96 153.34 146.84 153.8 146.39 152.41 144.96"/>
        <polygon class="cls-4" points="154.25 144.96 155.67 143.59 155.24 143.14 153.35 144.96 155.17 146.84 155.64 146.39 154.25 144.96"/>
        <polygon class="cls-4" points="156.08 144.96 157.5 143.59 157.07 143.14 155.18 144.96 157 146.84 157.47 146.39 156.08 144.96"/>
        <polygon class="cls-4" points="157.92 144.96 159.34 143.59 158.9 143.14 157.02 144.96 158.84 146.84 159.3 146.39 157.92 144.96"/>
        <polygon class="cls-4" points="94.34 119.36 95.76 117.99 95.32 117.54 93.44 119.36 95.26 121.25 95.72 120.8 94.34 119.36"/>
        <polygon class="cls-4" points="96.17 119.36 97.59 117.99 97.16 117.54 95.27 119.36 97.09 121.25 97.56 120.8 96.17 119.36"/>
        <polygon class="cls-4" points="98 119.36 99.42 117.99 98.99 117.54 97.11 119.36 98.93 121.25 99.39 120.8 98 119.36"/>
        <polygon class="cls-4" points="99.84 119.36 101.26 117.99 100.82 117.54 98.94 119.36 100.76 121.25 101.22 120.8 99.84 119.36"/>
      </g>
    </g>
    <g>
      <path class="cls-5" d="M85.26,51.1c-.24,.05-.43,.02-.63-.03-.95-.23-1.65-1.06-1.72-2.03-.01-.13-.01-.27-.01-.4,0-1.74,0-3.48,0-5.22,0-.51-.04-1.01-.18-1.5-.33-1.22-1.06-2.07-2.3-2.41-.86-.24-1.72-.22-2.56,.09-1.1,.4-1.77,1.22-2.09,2.33-.15,.51-.21,1.04-.21,1.57,0,2.43,0,4.86,0,7.29,0,.1,0,.2,0,.29-.19,.07-2.04,.08-2.38,.02,0-.1-.02-.21-.02-.31,0-2.45,0-4.9,0-7.34,0-.68-.08-1.34-.33-1.98-.47-1.18-1.34-1.86-2.59-2.05-.67-.1-1.34-.08-1.99,.14-1.19,.4-1.9,1.25-2.23,2.44-.16,.58-.2,1.17-.2,1.77,0,1.69,0,3.38,0,5.07,0,1.13-.81,2.1-1.93,2.28-.14,.02-.28,0-.45,0,0-.1-.02-.19-.02-.28,0-3.65,0-7.3,0-10.95,0-1,.44-1.74,1.34-2.2,.34-.17,.71-.23,1.05-.19,.04,.26,.02,.52,.02,.79,0,.26,0,.52,0,.83,.08-.06,.13-.08,.17-.12,.8-.98,1.86-1.52,3.09-1.71,1.27-.19,2.5-.04,3.66,.53,.89,.44,1.57,1.09,2.05,1.95,.04,.08,.09,.15,.15,.25,.05-.08,.09-.12,.12-.17,.69-1.33,1.81-2.1,3.23-2.45,1.35-.33,2.69-.23,3.97,.33,1.32,.58,2.16,1.59,2.65,2.93,.26,.71,.37,1.45,.37,2.2,0,2.65,0,5.3,0,7.95,0,.09,0,.18-.01,.29Z"/>
      <path class="cls-5" d="M106.49,37.49c0,.28,0,.54,0,.79,0,.26-.02,.51,.03,.82,.09-.09,.15-.14,.19-.19,.72-.86,1.66-1.37,2.75-1.58,1.37-.27,2.71-.12,3.98,.51,.86,.43,1.52,1.07,2,1.91,.05,.09,.1,.17,.17,.28,.05-.08,.09-.13,.12-.19,.69-1.31,1.8-2.09,3.21-2.44,1.5-.37,2.96-.23,4.33,.5,1.23,.66,1.98,1.71,2.39,3.03,.19,.62,.28,1.26,.28,1.91,0,2.65,0,5.3,0,7.95,0,.1-.01,.2-.02,.32-.16,0-.31,.02-.44,0-1.24-.22-1.87-1.24-1.91-2.06,0-.15-.01-.3-.01-.45,0-1.72,0-3.45,0-5.17,0-.51-.05-1.01-.17-1.5-.37-1.49-1.49-2.36-2.76-2.52-.61-.08-1.21-.07-1.8,.09-1.19,.33-1.95,1.11-2.34,2.27-.19,.56-.26,1.15-.26,1.74,0,2.43,0,4.86,0,7.29,0,.1,0,.2,0,.29-.23,.06-2.13,.07-2.39,0,0-.1,0-.2,0-.31,0-2.46,0-4.91,0-7.37,0-.69-.09-1.36-.35-2-.48-1.14-1.33-1.8-2.56-2-.67-.11-1.34-.08-1.99,.13-1.13,.37-1.83,1.15-2.19,2.26-.17,.53-.25,1.08-.25,1.64,0,1.73,0,3.47,0,5.2,0,.48-.07,.94-.32,1.35-.43,.69-1.04,1.08-1.86,1.13-.04,0-.08,0-.13,0-.02,0-.05-.01-.09-.03,0-.08-.02-.17-.02-.26,0-3.63,0-7.25,0-10.88,0-.67,.17-1.26,.63-1.75,.43-.45,.96-.7,1.59-.72,.05,0,.1,0,.2,.02Z"/>
      <path class="cls-5" d="M138.31,48.95c-.09,.09-.14,.13-.17,.18-.9,1.13-2.05,1.85-3.48,2.11-.61,.11-1.23,.15-1.86,.1-1-.08-1.93-.37-2.78-.9-1.43-.89-2.32-2.19-2.81-3.78-.31-.99-.36-2.02-.3-3.05,.08-1.45,.51-2.79,1.41-3.95,.95-1.24,2.21-2,3.74-2.29,.42-.08,.85-.14,1.27-.14,1.92,.01,3.57,.64,4.79,2.2,.03,.03,.05,.07,.08,.09,.01,.01,.03,.01,.05,.02,.09-.05,.06-.15,.06-.22,0-.51,0-1.03,0-1.54v-.28c.26-.08,.49-.02,.71,.04,1.02,.28,1.71,1.19,1.73,2.28,0,.2,0,.4,0,.61,0,2.74,0,5.48,0,8.23,0,.72-.23,1.36-.77,1.85-.42,.38-.91,.6-1.48,.6-.05,0-.1-.01-.17-.02,0-.09-.02-.18-.02-.27,0-.52,0-1.04,0-1.56,0-.09,0-.18-.02-.32Zm-4.5,.24c.18,0,.35,0,.53,0,.08,0,.17-.03,.25-.04,1.56-.27,2.65-1.14,3.28-2.58,.53-1.21,.58-2.48,.27-3.76-.57-2.34-2.63-3.73-5.01-3.38-1.51,.22-2.63,1.03-3.26,2.41-.72,1.55-.73,3.16-.06,4.72,.74,1.73,2.12,2.59,4,2.62Z"/>
      <path class="cls-5" d="M59.43,51.11v-2.14c-.08,.07-.13,.1-.16,.14-.9,1.15-2.08,1.88-3.52,2.14-1.81,.32-3.5,.02-5.01-1.08-1.27-.92-2.06-2.19-2.45-3.69-.45-1.73-.43-3.47,.23-5.16,.81-2.08,2.31-3.41,4.5-3.92,.35-.08,.71-.11,1.07-.14,.85-.07,1.68,.02,2.48,.29,1.06,.35,1.94,.95,2.64,1.83,.04,.05,.07,.09,.11,.14,.01,.01,.03,.02,.08,.04,.05-.23,.02-.45,.02-.67,0-.23,0-.45,0-.68s0-.45,0-.68c.14-.09,.28-.06,.4-.05,1.33,.19,2.05,1.31,2.04,2.3,0,3.01,0,6.02,0,9.03,0,.92-.62,2.05-1.96,2.29-.14,.03-.3,0-.49,0Zm0-6.9c.02-.4-.04-.89-.16-1.38-.65-2.67-3.11-3.89-5.43-3.32-1.56,.38-2.56,1.39-3.08,2.89-.37,1.08-.38,2.18-.13,3.28,.21,.95,.66,1.78,1.39,2.44,1.05,.94,2.29,1.23,3.66,1.03,1.47-.22,2.53-1.03,3.2-2.35,.4-.78,.56-1.62,.55-2.58Z"/>
      <path class="cls-5" d="M92.3,45.25c.02,.17,.02,.31,.04,.45,.25,1.75,1.41,3.04,3.13,3.46,.86,.21,1.72,.18,2.56-.09,.56-.17,1.03-.48,1.44-.89,.65-.65,1.42-1.09,2.33-1.29,.38-.08,.79-.11,1.08-.05-.02,.09-.04,.19-.07,.28-.73,2.16-2.22,3.5-4.42,4.05-.62,.16-1.26,.21-1.9,.2-1.68-.03-3.2-.51-4.46-1.65-1.06-.95-1.72-2.15-2.01-3.54-.33-1.57-.3-3.13,.23-4.65,.77-2.21,2.32-3.57,4.6-4.1,.46-.11,.93-.15,1.4-.17,.99-.05,1.95,.06,2.87,.42,2.11,.81,3.39,2.35,3.88,4.55,.17,.75,.19,1.52,.13,2.28-.01,.18-.02,.35-.03,.53,0,.12-.06,.19-.19,.18-.08,0-.17,0-.25,0-3.32,0-6.65,0-9.97,0-.11,0-.23,.01-.37,.02Zm.03-2.04c.14,0,.25,.02,.35,.02,2.54,0,5.08,0,7.62,0,.06,0,.12,0,.18,0,.12,0,.17-.06,.16-.17-.01-.15-.02-.3-.05-.45-.18-1.19-.76-2.12-1.82-2.7-1.12-.62-2.33-.77-3.56-.4-1.6,.48-2.51,1.61-2.83,3.23-.03,.14-.04,.29-.06,.47Z"/>
      <path class="cls-5" d="M48.95,51.12c-.25,0-.47,.03-.68,0-1.48-.21-2.64-.93-3.46-2.2-.51-.8-1.02-1.6-1.53-2.4-.05-.08-.11-.16-.19-.29-.08,.12-.14,.2-.19,.29-.52,.85-1.04,1.71-1.57,2.56-.64,1.04-1.56,1.7-2.75,1.97-.33,.08-.66,.1-1.03,.07,.04-.08,.06-.14,.09-.19,1.36-2.09,2.72-4.17,4.07-6.26,.24-.37,.24-.27,0-.63-1.34-2.1-2.69-4.19-4.03-6.28-.05-.08-.09-.15-.16-.27,.23,0,.42-.02,.61,0,1.05,.12,1.98,.52,2.76,1.24,.3,.28,.55,.59,.77,.93,.52,.81,1.03,1.61,1.55,2.42,.05,.08,.11,.16,.19,.28,.08-.11,.14-.19,.19-.27,.52-.85,1.04-1.69,1.55-2.54,.66-1.07,1.61-1.74,2.85-2,.3-.06,.61-.1,.95-.05-.05,.09-.09,.17-.13,.23-1.35,2.07-2.69,4.15-4.04,6.22-.01,.02-.03,.04-.04,.06-.13,.15-.12,.28,0,.45,1.06,1.64,2.11,3.28,3.16,4.93,.32,.5,.63,.99,.95,1.49,.04,.07,.08,.14,.14,.25Z"/>
      <path class="cls-5" d="M89.11,51.11h-2.34s-.03-.03-.03-.03c0,0,0-.01-.01-.02,0-.04-.02-.08-.02-.12,0-6.01,0-12.01,0-18.02,0-.03,0-.07,.01-.1,0-.02,.01-.03,.03-.06,.2-.06,.41,0,.61,.06,1.04,.26,1.76,1.17,1.76,2.25,0,2.44,0,4.88,0,7.32,0,2.79,0,5.59,0,8.38v.35Z"/>
      <path class="cls-5" d="M94.1,35.07c.24-.18,.46-.36,.69-.53,.7-.54,1.4-1.08,2.1-1.61,.94-.71,2.17-.66,3.03,.12,.11,.1,.2,.22,.31,.34-.07,.07-.13,.12-.19,.17-.87,.67-1.74,1.35-2.62,2.01-.96,.73-2.43,.64-3.28-.41-.02-.02-.02-.04-.04-.1Z"/>
      <path class="cls-5" d="M23.57,40.69l-.56,.88-7.56-11.34s-.07,0-.1,0c-.63,0-1.14-.51-1.14-1.14s.51-1.14,1.14-1.14,1.14,.51,1.14,1.14c0,.24-.07,.46-.19,.64l7.28,10.95Zm14.7-7.95c0-.81-.66-1.47-1.47-1.47s-1.46,.66-1.46,1.47c0,.32,.11,.62,.29,.87l-6.73,10.25-2.39-3.66,4.89-7.45s.07,0,.11,0c.81,0,1.46-.66,1.46-1.47s-.65-1.47-1.46-1.47-1.47,.66-1.47,1.47c0,.33,.11,.64,.3,.89l-4.55,6.93-4.54-6.93c.19-.25,.3-.56,.3-.89,0-.81-.65-1.47-1.46-1.47s-1.47,.66-1.47,1.47,.66,1.47,1.47,1.47c.04,0,.07,0,.1,0l4.88,7.45-2.5,3.82-6.83-10.43c.17-.24,.27-.54,.27-.85,0-.81-.66-1.47-1.47-1.47s-1.46,.66-1.46,1.47c0,.86,.75,1.55,1.61,1.46l7.15,10.91-6.14,9.47c-.06-.01-.13-.02-.19-.02-.36,0-.74,.14-.99,.41-.27,.25-.42,.62-.42,1s.15,.73,.41,1c.54,.54,1.48,.52,1.98,0,.26-.26,.41-.62,.41-.99,0-.26-.07-.51-.2-.74l5.85-9.04,2.39,3.65-4.43,6.79c-.44-.06-.89,.1-1.19,.4-.26,.25-.42,.62-.42,1s.15,.74,.4,.99c.26,.27,.63,.42,1,.42s.73-.15,.99-.41c.26-.26,.41-.62,.41-1,0-.26-.08-.52-.21-.74l4.13-6.33,3.88,6.31c-.14,.22-.21,.48-.21,.74-.01,.38,.14,.74,.41,1.01,.53,.53,1.48,.53,1.99,0,.26-.26,.42-.62,.42-1s-.15-.74-.41-.99c-.31-.31-.76-.47-1.19-.41l-4.17-6.76,2.49-3.8,5.7,9.27c-.14,.22-.21,.47-.22,.75,0,.38,.15,.75,.41,.99,.53,.54,1.46,.54,1.99,.01,.26-.26,.42-.63,.42-1s-.15-.75-.41-1c-.26-.26-.62-.41-.98-.41-.07,0-.14,0-.21,.01l-5.98-9.72,7.07-10.77c.85,.07,1.59-.61,1.59-1.46Zm-12.59,16.03l-2.39-3.66,2.5-3.81,2.39,3.66-2.5,3.81Zm11.5-19.67c0,.63-.51,1.14-1.14,1.14-.05,0-.09,0-.13-.01l-7.31,11.64-.59-.89,7.08-11.27c-.11-.18-.18-.39-.18-.61,0-.62,.51-1.14,1.14-1.14s1.14,.51,1.14,1.14Zm-1.05,30.42c0,.63-.51,1.14-1.14,1.14s-1.14-.51-1.14-1.14c0-.21,.06-.42,.17-.59l-6.21-9.68,.57-.89,6.44,10.04c.06-.01,.11-.02,.16-.02,.63,0,1.14,.51,1.14,1.14Zm-18.8-.65c.13,.19,.21,.41,.21,.65,0,.63-.51,1.14-1.14,1.14s-1.14-.51-1.14-1.14,.51-1.14,1.14-1.14c.03,0,.06,0,.08,0l6.43-10.08,.63,.83-6.21,9.72Z"/>
    </g>
  </g>
</svg>