create(sim_1:Sim {numero:3402345683})
create(sim_2:Sim {numero:3461712634})
create(sim_3:Sim {numero:3405432343})
create(sim_4:Sim {numero:3403245454})
create(sim_5:Sim {numero:3464439044})
create(sim_6:Sim {numero:3934834784})
create(sim_7:Sim {numero:3345435345})
create(sim_8:Sim {numero:3454345343})
create(sim_9:Sim {numero:3543234434})
create(sim_10:Sim {numero:2855454334})
create(sim_11:Sim {numero:6546544565})
create(sim_12:Sim {numero:6545654442})
create(sim_13:Sim {numero:1000000987})
create(sim_14:Sim {numero:4324343254})
create(sim_15:Sim {numero:65445254345})
create(sim_16:Sim {numero:6564653445})
create(sim_17:Sim {numero:4354543434})
create(sim_18:Sim {numero:5656464654})
create(sim_19:Sim {numero:365778888876})
create(sim_20:Sim {numero:34323242343})
create(sim_21:Sim {numero:354657543})
create(sim_22:Sim {numero:340545354353})
create(sim_23:Sim {numero:343454383})
create(sim_24:Sim {numero:365457743})
create(sim_25:Sim {numero:344353453})
create(sim_26:Sim {numero:23432432383})
create(sim_27:Sim {numero:234435433})
create(sim_28:Sim {numero:346543683})
create(sim_29:Sim {numero:1231231483})
create(sim_30:Sim {numero:5346577883})
create(sim_31:Sim {numero:2342576573})
create(sim_32:Sim {numero:8789867543})
create(sim_33:Sim {numero:33243565443})
create(sim_34:Sim {numero:4353545364563})
create(sim_35:Sim {numero:3454765753})
create(sim_36:Sim {numero:6546788783})
create(sim_37:Sim {numero:68878673})
create(sim_38:Sim {numero:342322424111})
create(sim_39:Sim {numero:123143583})
create(sim_40:Sim {numero:16657583})
create(sim_41:Sim {numero:1123425364})
create(sim_42:Sim {numero:12325334535})
create(sim_43:Sim {numero:2234247657})
create(sim_44:Sim {numero:3897896786})
create(sim_45:Sim {numero:567589987973})
create(sim_46:Sim {numero:345465646})
create(sim_47:Sim {numero:8679998775})
create(sim_48:Sim {numero:5674345345})
create(sim_49:Sim {numero:76768686564})
create(sim_50:Sim {numero:34534545775})
create(sim_51:Sim {numero:97808098877})


