\relax 
\providecommand\hyper@newdestlabel[2]{}
\providecommand\HyperFirstAtBeginDocument{\AtBeginDocument}
\HyperFirstAtBeginDocument{\ifx\hyper@anchor\@undefined
\global\let\oldcontentsline\contentsline
\gdef\contentsline#1#2#3#4{\oldcontentsline{#1}{#2}{#3}}
\global\let\oldnewlabel\newlabel
\gdef\newlabel#1#2{\newlabelxx{#1}#2}
\gdef\newlabelxx#1#2#3#4#5#6{\oldnewlabel{#1}{{#2}{#3}}}
\AtEndDocument{\ifx\hyper@anchor\@undefined
\let\contentsline\oldcontentsline
\let\newlabel\oldnewlabel
\fi}
\fi}
\global\let\hyper@last\relax 
\gdef\HyperFirstAtBeginDocument#1{#1}
\providecommand\HyField@AuxAddToFields[1]{}
\providecommand\HyField@AuxAddToCoFields[2]{}
\citation{Alexandru:2018fqp}
\citation{Lawrence:2021izu}
\bibdata{leeyangNotes,Self,References}
\bibcite{Alexandru:2018fqp}{{1}{2018}{{Alexandru\ \emph  {et~al.}}}{{Alexandru, Bedaque, Lamm,\ and\ Lawrence}}}
\bibcite{Lawrence:2021izu}{{2}{2021}{{Lawrence\ and\ Yamauchi}}{{}}}
\bibstyle{apsrev4-2}
\newlabel{FirstPage}{{}{1}{}{section*.1}{}}
\@writefile{toc}{\contentsline {title}{}{1}{section*.2}\protected@file@percent }
\@writefile{toc}{\contentsline {abstract}{Abstract}{1}{section*.1}\protected@file@percent }
\@writefile{toc}{\contentsline {section}{\numberline {I}Introduction}{1}{section*.3}\protected@file@percent }
\@writefile{toc}{\contentsline {section}{\numberline {}Acknowledgments}{1}{section*.4}\protected@file@percent }
\@writefile{toc}{\contentsline {section}{\numberline {}References}{1}{section*.5}\protected@file@percent }
\newlabel{LastBibItem}{{2}{1}{}{section*.5}{}}
\newlabel{LastPage}{{}{1}{}{}{}}
\gdef \@abspage@last{1}
