3x3 real:
Reweighting: (0.13328705772755647+0.3233872891150166j) (0.0005191229674609722+0.0005403453557070819j) 0.3497781847383114 1.1798519957936153 
(0.17337456092722672+0.08370628108731908j) (0.0007569658740796735+0.0008049604256398893j)
(0.024056536024917544+0.03932094301201291j) (0.0005395888885110307+0.0007479194259913601j)
(0.023978667956299753+0.03928436525817244j) (0.0007031452011951334+0.000688169757199215j)

3x3 trained: 
Reweighting: (0.3507333243318264+0.8619643067149786j) (0.0011369084153151272+0.0007020739550338107j) 0.9305892385190621 1.1843558149685351 
(0.14242426003952066-0.1279614551011338j) (0.0005401302915644318+0.0005374684368999685j)
(0.01188071467469087-0.0458501992470166j) (0.0004342589287861185+0.0005379307006515631j)
(0.01015127831428401-0.0461156028402941j) (0.0004808941848278222+0.0006030592876087033j)

4x4 real:
Reweighting: (-0.09182775811190247+0.1854403751764415j) (0.00035297869593502727+0.00044638982091974754j) 0.2069310752531805 2.0305865394708698 
(0.17569148006213392+0.07832020347635318j) (0.0009693533383178188+0.0008642816068048772j)
(0.02390318617528099+0.02952467470860283j) (0.0006135601811987866+0.0006207515448268536j)
(0.003223960841506225+0.015750179419321587j) (0.0008214053372860609+0.0005903440286606476j)
(0.023435202235185786+0.030003419133207754j) (0.0008061262224319266+0.0006356031897131513j)

4x4 trained:
Reweighting: (-0.39324478896409587+0.7968885860520116j) (0.0006493319996754534+0.0002985038398243688j) 0.8886354047793676 2.0292105194625467 
(0.14712182439006818-0.12233787175086368j) (0.00025170862122650753+0.0002590286360121764j)
(0.013133252908277743-0.038966095931466785j) (0.00022703241101852163+0.000228698535540988j)
(-0.001248914095193333-0.016159332639096673j) (0.00021449152452540304+0.00027528869236550336j)
(0.012002271102732463-0.03995486280596487j) (0.00019087265516461388+0.00025034237602279257j)

5x5 real:
Reweighting: (-0.0984651865203172-0.0008175130494302155j) (0.00021333609339363018+0.00034851292906764496j) 0.09846858018711778 -3.1332902850604367 
(0.1772021182880452+0.08006236441287784j) (0.0013929426011653609+0.0017075224978072893j)
(0.02573438174563781+0.028650525873691813j) (0.0011908969302605497+0.0010534378055504004j)
(0.0016271162802637764+0.009427048494914894j) (0.0008674312065089237+0.0011946087672086072j)
(0.0018555932905265525+0.010047704171104585j) (0.0007894554053081313+0.0008801329855705015j)
(0.025597751729865195+0.028843905833715912j) (0.0011662042367484558+0.0010577416528098976j)

5x5 trained:
Reweighting: (-0.8493432647074022-0.008480760400236743j) (0.00030170880420179964+0.0008472065751372644j) 0.8493856041874 -3.1316079054668644 
(0.14968778034368097-0.12012353463629163j) (0.0003483812538999021+0.00033175717527349555j)
(0.013900131225169601-0.03781256940912084j) (0.00023724164837121405+0.00029066739051068725j)
(-0.0010940085211864705-0.008826560800976149j) (0.00029992546177955794+0.0003137977232713917j)
(-0.0012087933382123437-0.009838102321971146j) (0.0002294740346040729+0.00026045003139502147j)
(0.013799372426314419-0.0380680906560216j) (0.00024002702167648152+0.00021889652229339533j)

6x6 real:
Reweighting: (-0.006672939424717819-0.03677164631152175j) (0.0004781949514439029+0.0003395138397463728j) 0.037372210170467636 -1.75031247024549 
(0.18755805670776507+0.08406227114699637j) (0.004977641183295962+0.00561620640434203j)
(0.02625332750043962+0.031004804816522177j) (0.00443215641408097+0.004197304777016219j)
(-0.0007399442314561144+0.010651374080678885j) (0.0027075347940825546+0.005217552097234569j)
(0.0006929628369677011+0.005373960232698508j) (0.0026874259823234086+0.0036672673870345265j)
(0.00556554362761767+0.0059751903156482j) (0.003203633723514165+0.003663449521187693j)
(0.029114868392926194+0.03973276035713011j) (0.003942127542236326+0.0038849018289280187j)

6x6 trained:
Reweighting: (-0.14120931753284569-0.7942341832882778j) (0.0011427066110548758+0.0005335294690234499j) 0.8066895370969489 -1.7467507561400661 
(0.15228571165753904-0.11566759950751365j) (0.00043024122869594276+0.0003659662491692589j)
(0.015416598162667274-0.036648086374968906j) (0.00035638860387144337+0.0003977632810502385j)
(0.0002938370269727763-0.007183649467401421j) (0.00029789025651618474+0.00033235330435755204j)
(-0.001189680618757952-0.002407145134110579j) (0.00036246290242133804+0.00038602439601412964j)
(-0.000651952140122726-0.00832691695611174j) (0.00032523509423372667+0.000328428393128892j)
(0.014956799241667006-0.03762552245353216j) (0.0003782270620893717+0.0003461771946674352j)

7x7 real:
Reweighting: (0.011356176855947324-0.0013037189523844026j) (0.00024451573777731325+0.0002646851901916051j) 0.01143076707357647 -0.11430222704055053 
(0.17230527698345363+0.07642548666141435j) (0.009656854549128737+0.014098669925039725j)
(0.02100060366127206+0.019316663461916503j) (0.008454392434146241+0.010853022383038324j)
(-0.004527507390368996+8.052985887943728e-05j) (0.009493276694624223+0.009033966269256621j)
(-0.001753485657559412+0.01024606562741835j) (0.008898033594270736+0.008322715725550123j)
(0.00432197569607043+0.02006923126520349j) (0.005930646680971999+0.007919747456852066j)
(-0.007226352176968072+0.020644858954218283j) (0.006585916897508592+0.008086596041429443j)
(0.027018274337948695+0.03266148205911382j) (0.008305572362594783+0.009369191806854102j)

7x7 trained:
Reweighting: (0.7589746750273437-0.08265450839319023j) (0.0005261409813196517+0.00143170943664586j) 0.763462065259684 -0.10847536889409093 
(0.15451373416340208-0.11423070858041284j) (0.00044864414004437773+0.00046432546505247106j)
(0.015670055282977786-0.037044813128337475j) (0.00024983693645000215+0.00030461410819805943j)
(-0.00020963946433989763-0.00898329068848462j) (0.0003521838278356496+0.00036663539487459047j)
(-0.00037614950200701706-0.0017457202770663266j) (0.00046437028863490116+0.0003832000875957469j)
(0.00011346567273417431-0.0014053059061153888j) (0.0003596396458676209+0.00046391812226443486j)
(-0.0007639564629472516-0.008946119826487811j) (0.0004469254510116963+0.0004051194906891721j)
(0.015435116569115595-0.036308533280321804j) (0.0004042850748085698+0.0003873793279538168j)

8x8 real:
Reweighting: (-0.000705232062367499+0.002835762129672579j) (0.0001927974302389071+0.00021310673741099207j) 0.0029221394761161346 1.8145437874603454 
(0.16541028095489804+0.15894281223466555j) (0.04284330391342826+0.03425110470948466j)
(0.02301038990215516+0.06462776755603608j) (0.02851738197791578+0.025419497562662947j)
(0.00803793743799585-0.0159193678144707j) (0.020415308262233388+0.026004672877603482j)
(0.003945732009689011+0.01400030280081369j) (0.020434263905655392+0.025101725111786453j)
(0.04030179466311033-0.01183987787077968j) (0.01702310362432128+0.02666632075426664j)
(0.03757020680657718+0.020766019927273734j) (0.020877990705688142+0.02269078695337713j)
(0.020905376644473995-0.004188673228838651j) (0.023304944975881686+0.027612912061645026j)
(0.051006346751799624+0.027685523262638425j) (0.02524426192415268+0.025249409566555338j)

8x8 trained:
Reweighting: (-0.1496232294634978+0.7028076776476363j) (0.0018684712823239232+0.00086921188891967j) 0.7185580996381228 1.7805582470640684 
(0.15498756946363368-0.11444546140624029j) (0.0006982990095838874+0.0004947850292087787j)
(0.015226205487719156-0.036184004433214366j) (0.0004895457851355534+0.000500962253913214j)
(-0.00019995113853883594-0.007492543306357119j) (0.0004967990906566435+0.00041388546201027966j)
(-0.0011278981340530187-0.0009884164473523732j) (0.00045176870441734137+0.0004586650140862459j)
(-0.00040255897006685054-0.00017811066652243784j) (0.00042591512903951395+0.0005150743114620072j)
(-0.001324402056914196-0.0015059900657622466j) (0.0005613057835108797+0.000432839411395637j)
(0.00015931255530249715-0.008237859605584758j) (0.0004569442442343154+0.0004105337981079966j)
(0.01646880402901452-0.03673515392958683j) (0.00035283447860090555+0.0005266770399224584j)

9x9 real:
(-0.0005645792796822043-0.0005958142928694765j) (0.00026492238631552006+0.00024149965455050207j) 0.0008208193678477811 -2.3292833857609168 
(0.23492615153565677-0.04031402102920061j) (0.35759840678059773+0.23875193588575563j)
(-0.05278110485107971-0.15360598415758941j) (0.21576393819300393+0.30586959547267717j)
(-0.05781847317368814-0.21677038880529287j) (0.12280628782856622+0.16306490705529464j)
(-0.08037690149074153+0.03246131680393769j) (0.1460733269099516+0.12508864843360654j)
(0.041561633809463615-0.21774130964142083j) (0.33616780077607883+0.3816638824641928j)
(-0.06119652522651576-0.25539764917927044j) (0.3022904136180931+0.24203890969930228j)
(-0.10546090225457672+0.038614210617232386j) (0.17779463196970974+0.13840100408504685j)
(0.18095107030674576+0.11010929438075466j) (0.2805254291912639+0.3379672450373827j)
(0.0004388555657173397-0.2205070576788842j) (0.17957491017033042+0.1642212950281905j)

9x9 trained:
Reweighting: (-0.47293200271220287-0.4640700775275439j) (0.0012739081620688525+0.0013748485859572904j) 0.6625901569188873 -2.3656519515532897 
(0.15544041520798269-0.11060787719446168j) (0.0005765895137395526+0.000551152321594182j)
(0.017015971868388744-0.035602712717702475j) (0.0005239539292993325+0.00040761537877280176j)
(0.0004885663267588298-0.00683943327226708j) (0.0004538138077996541+0.0006062218572970998j)
(-0.0006389845438584116-0.0014030545632782066j) (0.0006595685648086587+0.0004396796754912888j)
(-0.0008683269152479577-0.0007872717594025333j) (0.0006626301985127621+0.000454803693449889j)
(-0.00012981445881771485-0.0012016674330403154j) (0.0005473558063658434+0.0004924472710040309j)
(-0.0014580870713076935-0.00208877990535312j) (0.0005400569834578483+0.0003747370812053042j)
(0.00022752700242563661-0.007860236172217452j) (0.00047842289143468767+0.00040126687507834513j)
(0.015896563456169206-0.03454794777880622j) (0.00041992666766199713+0.0004846375915927886j)
