\relax 
\@writefile{toc}{\contentsline {section}{\numberline {1}Quantum mechanics}{1}{}\protected@file@percent }
\@writefile{toc}{\contentsline {subsection}{\numberline {1.1}Mean-field ground state}{1}{}\protected@file@percent }
\@writefile{toc}{\contentsline {subsection}{\numberline {1.2}Finite temperature}{1}{}\protected@file@percent }
\@writefile{toc}{\contentsline {section}{\numberline {2}Quantum field theory}{3}{}\protected@file@percent }
\@writefile{toc}{\contentsline {section}{\numberline {A}Harmonic oscillator calculations}{3}{}\protected@file@percent }
\gdef \@abspage@last{4}
