<?xml version="1.0" encoding="UTF-8" standalone="no"?>
<!-- Created with Inkscape (http://www.inkscape.org/) -->

<svg
   xmlns:ns0="http://www.iki.fi/pav/software/textext/"
   xmlns:dc="http://purl.org/dc/elements/1.1/"
   xmlns:cc="http://creativecommons.org/ns#"
   xmlns:rdf="http://www.w3.org/1999/02/22-rdf-syntax-ns#"
   xmlns:svg="http://www.w3.org/2000/svg"
   xmlns="http://www.w3.org/2000/svg"
   xmlns:xlink="http://www.w3.org/1999/xlink"
   xmlns:sodipodi="http://sodipodi.sourceforge.net/DTD/sodipodi-0.dtd"
   xmlns:inkscape="http://www.inkscape.org/namespaces/inkscape"
   width="2in"
   height="1.5in"
   viewBox="0 0 50.800001 38.100001"
   version="1.1"
   id="svg8"
   inkscape:version="0.92.4 5da689c313, 2019-01-14"
   sodipodi:docname="lattice4.svg">
  <defs
     id="defs2">
    <marker
       inkscape:stockid="Arrow1Mend"
       orient="auto"
       refY="0.0"
       refX="0.0"
       id="marker2549"
       style="overflow:visible;"
       inkscape:isstock="true">
      <path
         id="path1956"
         d="M 0.0,0.0 L 5.0,-5.0 L -12.5,0.0 L 5.0,5.0 L 0.0,0.0 z "
         style="fill-rule:evenodd;stroke:#009f00;stroke-width:1pt;stroke-opacity:1;fill:#009900;fill-opacity:1"
         transform="scale(0.4) rotate(180) translate(10,0)" />
    </marker>
    <inkscape:path-effect
       effect="spiro"
       id="path-effect2546"
       is_visible="true" />
    <marker
       inkscape:stockid="Arrow1Lend"
       orient="auto"
       refY="0.0"
       refX="0.0"
       id="marker2210"
       style="overflow:visible;"
       inkscape:isstock="true">
      <path
         id="path1950"
         d="M 0.0,0.0 L 5.0,-5.0 L -12.5,0.0 L 5.0,5.0 L 0.0,0.0 z "
         style="fill-rule:evenodd;stroke:#000084;stroke-width:1pt;stroke-opacity:1;fill:#00007c;fill-opacity:1"
         transform="scale(0.8) rotate(180) translate(12.5,0)" />
    </marker>
    <inkscape:path-effect
       effect="spiro"
       id="path-effect1945"
       is_visible="true" />
    <marker
       inkscape:stockid="Arrow1Lend"
       orient="auto"
       refY="0"
       refX="0"
       id="marker1577"
       style="overflow:visible"
       inkscape:isstock="true">
      <path
         id="path1317"
         d="M 0,0 5,-5 -12.5,0 5,5 Z"
         style="fill:#0000b6;fill-opacity:1;fill-rule:evenodd;stroke:#0000b6;stroke-width:1.00000003pt;stroke-opacity:1"
         transform="matrix(-0.8,0,0,-0.8,-10,0)"
         inkscape:connector-curvature="0" />
    </marker>
    <inkscape:path-effect
       effect="spiro"
       id="path-effect1312"
       is_visible="true" />
    <marker
       inkscape:stockid="Arrow1Lend"
       orient="auto"
       refY="0"
       refX="0"
       id="marker2404"
       style="overflow:visible"
       inkscape:isstock="true">
      <path
         id="path2402"
         d="M 0,0 5,-5 -12.5,0 5,5 Z"
         style="fill:#0000cb;fill-opacity:1;fill-rule:evenodd;stroke:#0000cb;stroke-width:1.00000003pt;stroke-opacity:1"
         transform="matrix(-0.8,0,0,-0.8,-10,0)"
         inkscape:connector-curvature="0" />
    </marker>
    <marker
       inkscape:stockid="Arrow1Lstart"
       orient="auto"
       refY="0"
       refX="0"
       id="Arrow1Lstart"
       style="overflow:visible"
       inkscape:isstock="true">
      <path
         id="path817"
         d="M 0,0 5,-5 -12.5,0 5,5 Z"
         style="fill:#000000;fill-opacity:1;fill-rule:evenodd;stroke:#000000;stroke-width:1.00000003pt;stroke-opacity:1"
         transform="matrix(0.8,0,0,0.8,10,0)"
         inkscape:connector-curvature="0" />
    </marker>
    <marker
       inkscape:stockid="Arrow1Mend"
       orient="auto"
       refY="0"
       refX="0"
       id="Arrow1Mend"
       style="overflow:visible"
       inkscape:isstock="true">
      <path
         id="path826"
         d="M 0,0 5,-5 -12.5,0 5,5 Z"
         style="fill:#000000;fill-opacity:1;fill-rule:evenodd;stroke:#000000;stroke-width:1.00000003pt;stroke-opacity:1"
         transform="matrix(-0.4,0,0,-0.4,-4,0)"
         inkscape:connector-curvature="0" />
    </marker>
    <marker
       inkscape:stockid="Arrow1Mstart"
       orient="auto"
       refY="0"
       refX="0"
       id="Arrow1Mstart"
       style="overflow:visible"
       inkscape:isstock="true">
      <path
         id="path823"
         d="M 0,0 5,-5 -12.5,0 5,5 Z"
         style="fill:#000000;fill-opacity:1;fill-rule:evenodd;stroke:#000000;stroke-width:1.00000003pt;stroke-opacity:1"
         transform="matrix(0.4,0,0,0.4,4,0)"
         inkscape:connector-curvature="0" />
    </marker>
    <marker
       inkscape:stockid="Arrow1Lend"
       orient="auto"
       refY="0"
       refX="0"
       id="Arrow1Lend"
       style="overflow:visible"
       inkscape:isstock="true">
      <path
         id="path820"
         d="M 0,0 5,-5 -12.5,0 5,5 Z"
         style="fill:#0000cb;fill-opacity:1;fill-rule:evenodd;stroke:#0000cb;stroke-width:1.00000003pt;stroke-opacity:1"
         transform="matrix(-0.8,0,0,-0.8,-10,0)"
         inkscape:connector-curvature="0" />
    </marker>
    <marker
       inkscape:stockid="Arrow1Lend"
       orient="auto"
       refY="0"
       refX="0"
       id="marker2404-8"
       style="overflow:visible"
       inkscape:isstock="true">
      <path
         inkscape:connector-curvature="0"
         id="path2402-0"
         d="M 0,0 5,-5 -12.5,0 5,5 Z"
         style="fill:#0000cb;fill-opacity:1;fill-rule:evenodd;stroke:#0000cb;stroke-width:1.00000003pt;stroke-opacity:1"
         transform="matrix(-0.8,0,0,-0.8,-10,0)" />
    </marker>
    <marker
       inkscape:stockid="Arrow1Lend"
       orient="auto"
       refY="0"
       refX="0"
       id="marker2404-2"
       style="overflow:visible"
       inkscape:isstock="true">
      <path
         inkscape:connector-curvature="0"
         id="path2402-9"
         d="M 0,0 5,-5 -12.5,0 5,5 Z"
         style="fill:#0000cb;fill-opacity:1;fill-rule:evenodd;stroke:#0000cb;stroke-width:1.00000003pt;stroke-opacity:1"
         transform="matrix(-0.8,0,0,-0.8,-10,0)" />
    </marker>
    <marker
       inkscape:stockid="Arrow1Lend"
       orient="auto"
       refY="0"
       refX="0"
       id="marker2404-1"
       style="overflow:visible"
       inkscape:isstock="true">
      <path
         inkscape:connector-curvature="0"
         id="path2402-04"
         d="M 0,0 5,-5 -12.5,0 5,5 Z"
         style="fill:#0000cb;fill-opacity:1;fill-rule:evenodd;stroke:#0000cb;stroke-width:1.00000003pt;stroke-opacity:1"
         transform="matrix(-0.8,0,0,-0.8,-10,0)" />
    </marker>
    <marker
       inkscape:stockid="Arrow1Lend"
       orient="auto"
       refY="0"
       refX="0"
       id="marker1577-4"
       style="overflow:visible"
       inkscape:isstock="true">
      <path
         inkscape:connector-curvature="0"
         id="path1317-8"
         d="M 0,0 5,-5 -12.5,0 5,5 Z"
         style="fill:#0000b6;fill-opacity:1;fill-rule:evenodd;stroke:#0000b6;stroke-width:1.00000003pt;stroke-opacity:1"
         transform="matrix(-0.8,0,0,-0.8,-10,0)" />
    </marker>
    <inkscape:path-effect
       effect="spiro"
       id="path-effect1312-5"
       is_visible="true" />
    <marker
       inkscape:stockid="Arrow1Lend"
       orient="auto"
       refY="0"
       refX="0"
       id="marker1577-2"
       style="overflow:visible"
       inkscape:isstock="true">
      <path
         inkscape:connector-curvature="0"
         id="path1317-6"
         d="M 0,0 5,-5 -12.5,0 5,5 Z"
         style="fill:#0000b6;fill-opacity:1;fill-rule:evenodd;stroke:#0000b6;stroke-width:1.00000003pt;stroke-opacity:1"
         transform="matrix(-0.8,0,0,-0.8,-10,0)" />
    </marker>
    <inkscape:path-effect
       effect="spiro"
       id="path-effect1312-0"
       is_visible="true" />
    <marker
       inkscape:stockid="Arrow1Lend"
       orient="auto"
       refY="0"
       refX="0"
       id="marker1577-6"
       style="overflow:visible"
       inkscape:isstock="true">
      <path
         inkscape:connector-curvature="0"
         id="path1317-4"
         d="M 0,0 5,-5 -12.5,0 5,5 Z"
         style="fill:#0000af;fill-opacity:1;fill-rule:evenodd;stroke:#0000b6;stroke-width:1.00000003pt;stroke-opacity:1"
         transform="matrix(-0.8,0,0,-0.8,-10,0)" />
    </marker>
    <inkscape:path-effect
       effect="spiro"
       id="path-effect1312-6"
       is_visible="true" />
    <marker
       inkscape:stockid="Arrow1Lend"
       orient="auto"
       refY="0"
       refX="0"
       id="marker2210-4"
       style="overflow:visible"
       inkscape:isstock="true">
      <path
         inkscape:connector-curvature="0"
         id="path1950-2"
         d="M 0,0 5,-5 -12.5,0 5,5 Z"
         style="fill:#00007c;fill-opacity:1;fill-rule:evenodd;stroke:#000084;stroke-width:1.00000003pt;stroke-opacity:1"
         transform="matrix(-0.8,0,0,-0.8,-10,0)" />
    </marker>
    <inkscape:path-effect
       effect="spiro"
       id="path-effect1945-2"
       is_visible="true" />
    <marker
       inkscape:stockid="Arrow1Lend"
       orient="auto"
       refY="0"
       refX="0"
       id="marker2210-5"
       style="overflow:visible"
       inkscape:isstock="true">
      <path
         inkscape:connector-curvature="0"
         id="path1950-1"
         d="M 0,0 5,-5 -12.5,0 5,5 Z"
         style="fill:#00007c;fill-opacity:1;fill-rule:evenodd;stroke:#000084;stroke-width:1.00000003pt;stroke-opacity:1"
         transform="matrix(-0.8,0,0,-0.8,-10,0)" />
    </marker>
    <inkscape:path-effect
       effect="spiro"
       id="path-effect1945-7"
       is_visible="true" />
    <marker
       inkscape:stockid="Arrow1Lend"
       orient="auto"
       refY="0"
       refX="0"
       id="marker2210-7"
       style="overflow:visible"
       inkscape:isstock="true">
      <path
         inkscape:connector-curvature="0"
         id="path1950-16"
         d="M 0,0 5,-5 -12.5,0 5,5 Z"
         style="fill:#00007c;fill-opacity:1;fill-rule:evenodd;stroke:#000084;stroke-width:1.00000003pt;stroke-opacity:1"
         transform="matrix(-0.8,0,0,-0.8,-10,0)" />
    </marker>
    <inkscape:path-effect
       effect="spiro"
       id="path-effect1945-9"
       is_visible="true" />
    <marker
       inkscape:stockid="Arrow1Lend"
       orient="auto"
       refY="0"
       refX="0"
       id="marker2210-7-1"
       style="overflow:visible"
       inkscape:isstock="true">
      <path
         inkscape:connector-curvature="0"
         id="path1950-16-3"
         d="M 0,0 5,-5 -12.5,0 5,5 Z"
         style="fill:#00007c;fill-opacity:1;fill-rule:evenodd;stroke:#000084;stroke-width:1.00000003pt;stroke-opacity:1"
         transform="matrix(-0.8,0,0,-0.8,-10,0)" />
    </marker>
    <inkscape:path-effect
       effect="spiro"
       id="path-effect1945-9-3"
       is_visible="true" />
    <marker
       inkscape:stockid="Arrow1Mend"
       orient="auto"
       refY="0"
       refX="0"
       id="marker2549-9"
       style="overflow:visible"
       inkscape:isstock="true">
      <path
         inkscape:connector-curvature="0"
         id="path1956-8"
         d="M 0,0 5,-5 -12.5,0 5,5 Z"
         style="fill:#009d00;fill-opacity:1;fill-rule:evenodd;stroke:#009d00;stroke-width:1.00000003pt;stroke-opacity:1"
         transform="matrix(-0.4,0,0,-0.4,-4,0)" />
    </marker>
    <inkscape:path-effect
       effect="spiro"
       id="path-effect2546-6"
       is_visible="true" />
  </defs>
  <sodipodi:namedview
     id="base"
     pagecolor="#ffffff"
     bordercolor="#666666"
     borderopacity="1.0"
     inkscape:pageopacity="0.0"
     inkscape:pageshadow="2"
     inkscape:zoom="2.5751711"
     inkscape:cx="75.665606"
     inkscape:cy="89.323124"
     inkscape:document-units="mm"
     inkscape:current-layer="layer1"
     showgrid="false"
     units="in"
     inkscape:window-width="1366"
     inkscape:window-height="721"
     inkscape:window-x="0"
     inkscape:window-y="0"
     inkscape:window-maximized="1" />
  <metadata
     id="metadata5">
    <rdf:RDF>
      <cc:Work
         rdf:about="">
        <dc:format>image/svg+xml</dc:format>
        <dc:type
           rdf:resource="http://purl.org/dc/dcmitype/StillImage" />
        <dc:title />
      </cc:Work>
    </rdf:RDF>
  </metadata>
  <g
     inkscape:label="Layer 1"
     inkscape:groupmode="layer"
     id="layer1"
     transform="translate(0,-258.89998)">
    <rect
       style="fill:none;fill-opacity:1;stroke:#000002;stroke-width:1.07927322;stroke-linecap:round;stroke-linejoin:miter;stroke-miterlimit:4;stroke-dasharray:none;stroke-dashoffset:0;stroke-opacity:1;paint-order:normal"
       id="rect1411"
       width="17.848312"
       height="17.848312"
       x="12.648409"
       y="269.19998" />
    <rect
       style="fill:none;fill-opacity:1;stroke:#000002;stroke-width:1.07927322;stroke-linecap:round;stroke-linejoin:miter;stroke-miterlimit:4;stroke-dasharray:none;stroke-dashoffset:0;stroke-opacity:1;paint-order:normal"
       id="rect1411-9"
       width="17.848312"
       height="17.848312"
       x="30.496721"
       y="269.19998" />
    <g
       id="g1042"
       ns0:preamble="/home/srl/Talks/2018/SOMME-18-04-2018/preamble.tex"
       ns0:text="$V_1$"
       transform="matrix(0.6296315,0,0,0.6296315,-140.14408,210.66247)"
       style="stroke:#009f00;stroke-opacity:1;fill:#009900;fill-opacity:1">
      <defs
         id="defs1031">
        <g
           id="g1029">
          <symbol
             id="textext-e3d32ea5-0"
             overflow="visible"
             style="overflow:visible">
            <path
               id="path1017"
               d=""
               style="stroke:none"
               inkscape:connector-curvature="0" />
          </symbol>
          <symbol
             id="textext-e3d32ea5-1"
             overflow="visible"
             style="overflow:visible">
            <path
               id="path1020"
               d="M 6.265625,-5.671875 C 6.75,-6.453125 7.171875,-6.484375 7.53125,-6.5 c 0.125,-0.015625 0.140625,-0.171875 0.140625,-0.1875 0,-0.078125 -0.0625,-0.125 -0.140625,-0.125 -0.25,0 -0.546875,0.03125 -0.8125,0.03125 -0.328125,0 -0.671875,-0.03125 -0.984375,-0.03125 -0.0625,0 -0.1875,0 -0.1875,0.1875 0,0.109375 0.078125,0.125 0.15625,0.125 0.265625,0.015625 0.453125,0.125 0.453125,0.328125 0,0.15625 -0.140625,0.375 -0.140625,0.375 l -3.0625,4.875 -0.6875,-5.28125 C 2.265625,-6.375 2.5,-6.5 2.953125,-6.5 c 0.140625,0 0.25,0 0.25,-0.203125 0,-0.078125 -0.078125,-0.109375 -0.125,-0.109375 -0.40625,0 -0.828125,0.03125 -1.25,0.03125 -0.171875,0 -0.359375,0 -0.546875,0 -0.171875,0 -0.359375,-0.03125 -0.53125,-0.03125 -0.078125,0 -0.1875,0 -0.1875,0.1875 0,0.125 0.078125,0.125 0.25,0.125 0.546875,0 0.5625,0.09375 0.59375,0.34375 L 2.1875,-0.015625 C 2.21875,0.1875 2.265625,0.21875 2.390625,0.21875 c 0.15625,0 0.203125,-0.046875 0.28125,-0.171875 z m 0,0"
               style="stroke:none"
               inkscape:connector-curvature="0" />
          </symbol>
          <symbol
             id="textext-e3d32ea5-2"
             overflow="visible"
             style="overflow:visible">
            <path
               id="path1023"
               d=""
               style="stroke:none"
               inkscape:connector-curvature="0" />
          </symbol>
          <symbol
             id="textext-e3d32ea5-3"
             overflow="visible"
             style="overflow:visible">
            <path
               id="path1026"
               d="m 2.328125,-4.4375 c 0,-0.1875 0,-0.1875 -0.203125,-0.1875 -0.453125,0.4375 -1.078125,0.4375 -1.359375,0.4375 v 0.25 c 0.15625,0 0.625,0 1,-0.1875 v 3.546875 c 0,0.234375 0,0.328125 -0.6875,0.328125 H 0.8125 V 0 c 0.125,0 0.984375,-0.03125 1.234375,-0.03125 0.21875,0 1.09375,0.03125 1.25,0.03125 V -0.25 H 3.03125 c -0.703125,0 -0.703125,-0.09375 -0.703125,-0.328125 z m 0,0"
               style="stroke:none"
               inkscape:connector-curvature="0" />
          </symbol>
        </g>
      </defs>
      <g
         id="textext-e3d32ea5-4"
         style="stroke:#009f00;stroke-opacity:1;fill:#009900;fill-opacity:1">
        <g
           id="g1035"
           style="fill:#009900;fill-opacity:1;stroke:#009f00;stroke-opacity:1">
          <use
             id="use1033"
             y="134.765"
             x="223.43201"
             xlink:href="#textext-e3d32ea5-1"
             width="100%"
             height="100%"
             style="stroke:#009f00;stroke-opacity:1;fill:#009900;fill-opacity:1" />
        </g>
        <g
           id="g1039"
           style="fill:#009900;fill-opacity:1;stroke:#009f00;stroke-opacity:1">
          <use
             id="use1037"
             y="136.259"
             x="229.244"
             xlink:href="#textext-e3d32ea5-3"
             width="100%"
             height="100%"
             style="stroke:#009f00;stroke-opacity:1;fill:#009900;fill-opacity:1" />
        </g>
      </g>
    </g>
    <g
       id="g1258"
       ns0:preamble="/home/srl/Talks/2018/SOMME-18-04-2018/preamble.tex"
       ns0:text="$U_{12}$"
       transform="matrix(0.6296315,0,0,0.6296315,-123.02334,208.86398)"
       style="fill:#000082;fill-opacity:1">
      <defs
         id="defs1245">
        <g
           id="g1243">
          <symbol
             id="textext-05734289-0"
             overflow="visible"
             style="overflow:visible">
            <path
               id="path1228"
               d=""
               style="stroke:none"
               inkscape:connector-curvature="0" />
          </symbol>
          <symbol
             id="textext-05734289-1"
             overflow="visible"
             style="overflow:visible">
            <path
               id="path1231"
               d="M 6.328125,-5.765625 C 6.4375,-6.171875 6.609375,-6.46875 7.40625,-6.5 c 0.046875,0 0.171875,-0.015625 0.171875,-0.203125 0,0 0,-0.109375 -0.125,-0.109375 -0.328125,0 -0.6875,0.03125 -1.015625,0.03125 -0.34375,0 -0.71875,-0.03125 -1.046875,-0.03125 -0.0625,0 -0.171875,0 -0.171875,0.203125 C 5.21875,-6.5 5.3125,-6.5 5.390625,-6.5 c 0.578125,0.015625 0.6875,0.21875 0.6875,0.4375 0,0.03125 -0.03125,0.1875 -0.03125,0.203125 l -0.90625,3.5625 C 4.8125,-0.953125 3.65625,-0.09375 2.65625,-0.09375 c -0.671875,0 -1.203125,-0.4375 -1.203125,-1.296875 0,-0.015625 0,-0.328125 0.109375,-0.765625 L 2.515625,-6.046875 C 2.609375,-6.40625 2.625,-6.5 3.359375,-6.5 c 0.265625,0 0.34375,0 0.34375,-0.203125 0,-0.109375 -0.109375,-0.109375 -0.140625,-0.109375 -0.28125,0 -1,0.03125 -1.28125,0.03125 -0.28125,0 -1,-0.03125 -1.28125,-0.03125 -0.078125,0 -0.1875,0 -0.1875,0.203125 C 0.8125,-6.5 0.890625,-6.5 1.09375,-6.5 c 0.015625,0 0.203125,0 0.375,0.015625 0.171875,0.03125 0.265625,0.03125 0.265625,0.171875 0,0.046875 -0.109375,0.46875 -0.171875,0.703125 l -0.21875,0.875 C 1.25,-4.34375 0.78125,-2.46875 0.734375,-2.265625 0.671875,-2 0.671875,-1.84375 0.671875,-1.6875 c 0,1.203125 0.90625,1.90625 1.953125,1.90625 1.25,0 2.484375,-1.125 2.8125,-2.4375 z m 0,0"
               style="stroke:none"
               inkscape:connector-curvature="0" />
          </symbol>
          <symbol
             id="textext-05734289-2"
             overflow="visible"
             style="overflow:visible">
            <path
               id="path1234"
               d=""
               style="stroke:none"
               inkscape:connector-curvature="0" />
          </symbol>
          <symbol
             id="textext-05734289-3"
             overflow="visible"
             style="overflow:visible">
            <path
               id="path1237"
               d="m 2.328125,-4.4375 c 0,-0.1875 0,-0.1875 -0.203125,-0.1875 -0.453125,0.4375 -1.078125,0.4375 -1.359375,0.4375 v 0.25 c 0.15625,0 0.625,0 1,-0.1875 v 3.546875 c 0,0.234375 0,0.328125 -0.6875,0.328125 H 0.8125 V 0 c 0.125,0 0.984375,-0.03125 1.234375,-0.03125 0.21875,0 1.09375,0.03125 1.25,0.03125 V -0.25 H 3.03125 c -0.703125,0 -0.703125,-0.09375 -0.703125,-0.328125 z m 0,0"
               style="stroke:none"
               inkscape:connector-curvature="0" />
          </symbol>
          <symbol
             id="textext-05734289-4"
             overflow="visible"
             style="overflow:visible">
            <path
               id="path1240"
               d="M 3.515625,-1.265625 H 3.28125 c -0.015625,0.15625 -0.09375,0.5625 -0.1875,0.625 C 3.046875,-0.59375 2.515625,-0.59375 2.40625,-0.59375 H 1.125 c 0.734375,-0.640625 0.984375,-0.84375 1.390625,-1.171875 0.515625,-0.40625 1,-0.84375 1,-1.5 0,-0.84375 -0.734375,-1.359375 -1.625,-1.359375 -0.859375,0 -1.453125,0.609375 -1.453125,1.25 0,0.34375 0.296875,0.390625 0.375,0.390625 0.15625,0 0.359375,-0.125 0.359375,-0.375 0,-0.125 -0.046875,-0.375 -0.40625,-0.375 C 0.984375,-4.21875 1.453125,-4.375 1.78125,-4.375 c 0.703125,0 1.0625,0.546875 1.0625,1.109375 0,0.609375 -0.4375,1.078125 -0.65625,1.328125 L 0.515625,-0.265625 C 0.4375,-0.203125 0.4375,-0.1875 0.4375,0 h 2.875 z m 0,0"
               style="stroke:none"
               inkscape:connector-curvature="0" />
          </symbol>
        </g>
      </defs>
      <g
         id="textext-05734289-5"
         style="fill:#000082;fill-opacity:1">
        <g
           id="g1249"
           style="fill:#000082;fill-opacity:1">
          <use
             id="use1247"
             y="134.765"
             x="223.43201"
             xlink:href="#textext-05734289-1"
             width="100%"
             height="100%"
             style="fill:#000082;fill-opacity:1" />
        </g>
        <g
           id="g1255"
           style="fill:#000082;fill-opacity:1">
          <use
             id="use1251"
             y="136.259"
             x="230.23399"
             xlink:href="#textext-05734289-3"
             width="100%"
             height="100%"
             style="fill:#000082;fill-opacity:1" />
          <use
             id="use1253"
             y="136.259"
             x="234.20558"
             xlink:href="#textext-05734289-4"
             width="100%"
             height="100%"
             style="fill:#000082;fill-opacity:1" />
        </g>
      </g>
    </g>
    <g
       id="g1395"
       ns0:preamble="/home/srl/Talks/2018/SOMME-18-04-2018/preamble.tex"
       ns0:text="$U_{23}$"
       transform="matrix(0.6296315,0,0,0.6296315,-101.02063,209.45872)"
       style="fill:#000082;fill-opacity:1">
      <defs
         id="defs1382">
        <g
           id="g1380">
          <symbol
             id="textext-235b46dc-0"
             overflow="visible"
             style="overflow:visible">
            <path
               id="path1365"
               d=""
               style="stroke:none"
               inkscape:connector-curvature="0" />
          </symbol>
          <symbol
             id="textext-235b46dc-1"
             overflow="visible"
             style="overflow:visible">
            <path
               id="path1368"
               d="M 6.328125,-5.765625 C 6.4375,-6.171875 6.609375,-6.46875 7.40625,-6.5 c 0.046875,0 0.171875,-0.015625 0.171875,-0.203125 0,0 0,-0.109375 -0.125,-0.109375 -0.328125,0 -0.6875,0.03125 -1.015625,0.03125 -0.34375,0 -0.71875,-0.03125 -1.046875,-0.03125 -0.0625,0 -0.171875,0 -0.171875,0.203125 C 5.21875,-6.5 5.3125,-6.5 5.390625,-6.5 c 0.578125,0.015625 0.6875,0.21875 0.6875,0.4375 0,0.03125 -0.03125,0.1875 -0.03125,0.203125 l -0.90625,3.5625 C 4.8125,-0.953125 3.65625,-0.09375 2.65625,-0.09375 c -0.671875,0 -1.203125,-0.4375 -1.203125,-1.296875 0,-0.015625 0,-0.328125 0.109375,-0.765625 L 2.515625,-6.046875 C 2.609375,-6.40625 2.625,-6.5 3.359375,-6.5 c 0.265625,0 0.34375,0 0.34375,-0.203125 0,-0.109375 -0.109375,-0.109375 -0.140625,-0.109375 -0.28125,0 -1,0.03125 -1.28125,0.03125 -0.28125,0 -1,-0.03125 -1.28125,-0.03125 -0.078125,0 -0.1875,0 -0.1875,0.203125 C 0.8125,-6.5 0.890625,-6.5 1.09375,-6.5 c 0.015625,0 0.203125,0 0.375,0.015625 0.171875,0.03125 0.265625,0.03125 0.265625,0.171875 0,0.046875 -0.109375,0.46875 -0.171875,0.703125 l -0.21875,0.875 C 1.25,-4.34375 0.78125,-2.46875 0.734375,-2.265625 0.671875,-2 0.671875,-1.84375 0.671875,-1.6875 c 0,1.203125 0.90625,1.90625 1.953125,1.90625 1.25,0 2.484375,-1.125 2.8125,-2.4375 z m 0,0"
               style="stroke:none"
               inkscape:connector-curvature="0" />
          </symbol>
          <symbol
             id="textext-235b46dc-2"
             overflow="visible"
             style="overflow:visible">
            <path
               id="path1371"
               d=""
               style="stroke:none"
               inkscape:connector-curvature="0" />
          </symbol>
          <symbol
             id="textext-235b46dc-3"
             overflow="visible"
             style="overflow:visible">
            <path
               id="path1374"
               d="M 3.515625,-1.265625 H 3.28125 c -0.015625,0.15625 -0.09375,0.5625 -0.1875,0.625 C 3.046875,-0.59375 2.515625,-0.59375 2.40625,-0.59375 H 1.125 c 0.734375,-0.640625 0.984375,-0.84375 1.390625,-1.171875 0.515625,-0.40625 1,-0.84375 1,-1.5 0,-0.84375 -0.734375,-1.359375 -1.625,-1.359375 -0.859375,0 -1.453125,0.609375 -1.453125,1.25 0,0.34375 0.296875,0.390625 0.375,0.390625 0.15625,0 0.359375,-0.125 0.359375,-0.375 0,-0.125 -0.046875,-0.375 -0.40625,-0.375 C 0.984375,-4.21875 1.453125,-4.375 1.78125,-4.375 c 0.703125,0 1.0625,0.546875 1.0625,1.109375 0,0.609375 -0.4375,1.078125 -0.65625,1.328125 L 0.515625,-0.265625 C 0.4375,-0.203125 0.4375,-0.1875 0.4375,0 h 2.875 z m 0,0"
               style="stroke:none"
               inkscape:connector-curvature="0" />
          </symbol>
          <symbol
             id="textext-235b46dc-4"
             overflow="visible"
             style="overflow:visible">
            <path
               id="path1377"
               d="m 1.90625,-2.328125 c 0.546875,0 0.9375,0.375 0.9375,1.125 0,0.859375 -0.515625,1.125 -0.90625,1.125 -0.28125,0 -0.90625,-0.078125 -1.1875,-0.5 0.328125,0 0.40625,-0.234375 0.40625,-0.390625 0,-0.21875 -0.171875,-0.375 -0.390625,-0.375 -0.1875,0 -0.390625,0.125 -0.390625,0.40625 0,0.65625 0.71875,1.078125 1.5625,1.078125 0.96875,0 1.640625,-0.65625 1.640625,-1.34375 0,-0.546875 -0.4375,-1.09375 -1.203125,-1.25 0.71875,-0.265625 0.984375,-0.78125 0.984375,-1.21875 0,-0.546875 -0.625,-0.953125 -1.40625,-0.953125 -0.765625,0 -1.359375,0.375 -1.359375,0.9375 0,0.234375 0.15625,0.359375 0.359375,0.359375 0.21875,0 0.359375,-0.15625 0.359375,-0.34375 0,-0.203125 -0.140625,-0.359375 -0.359375,-0.375 0.25,-0.296875 0.71875,-0.375 0.984375,-0.375 0.3125,0 0.75,0.15625 0.75,0.75 0,0.296875 -0.09375,0.625 -0.28125,0.828125 -0.21875,0.265625 -0.421875,0.28125 -0.765625,0.3125 -0.171875,0.015625 -0.1875,0.015625 -0.21875,0.015625 -0.015625,0 -0.078125,0.015625 -0.078125,0.09375 0,0.09375 0.0625,0.09375 0.1875,0.09375 z m 0,0"
               style="stroke:none"
               inkscape:connector-curvature="0" />
          </symbol>
        </g>
      </defs>
      <g
         id="textext-235b46dc-5"
         style="fill:#000082;fill-opacity:1">
        <g
           id="g1386"
           style="fill:#000082;fill-opacity:1">
          <use
             id="use1384"
             y="134.765"
             x="223.43201"
             xlink:href="#textext-235b46dc-1"
             width="100%"
             height="100%"
             style="fill:#000082;fill-opacity:1" />
        </g>
        <g
           id="g1392"
           style="fill:#000082;fill-opacity:1">
          <use
             id="use1388"
             y="136.259"
             x="230.23399"
             xlink:href="#textext-235b46dc-3"
             width="100%"
             height="100%"
             style="fill:#000082;fill-opacity:1" />
          <use
             id="use1390"
             y="136.259"
             x="234.20558"
             xlink:href="#textext-235b46dc-4"
             width="100%"
             height="100%"
             style="fill:#000082;fill-opacity:1" />
        </g>
      </g>
    </g>
    <g
       id="g1551"
       ns0:preamble="/home/srl/Talks/2018/SOMME-18-04-2018/preamble.tex"
       ns0:text="$U_{14}$"
       transform="matrix(0.6296315,0,0,0.6296315,-140.28774,193.50826)"
       style="fill:#000082;fill-opacity:1">
      <defs
         id="defs1538">
        <g
           id="g1536">
          <symbol
             id="textext-ccf6af58-0"
             overflow="visible"
             style="overflow:visible">
            <path
               id="path1521"
               d=""
               style="stroke:none"
               inkscape:connector-curvature="0" />
          </symbol>
          <symbol
             id="textext-ccf6af58-1"
             overflow="visible"
             style="overflow:visible">
            <path
               id="path1524"
               d="M 6.328125,-5.765625 C 6.4375,-6.171875 6.609375,-6.46875 7.40625,-6.5 c 0.046875,0 0.171875,-0.015625 0.171875,-0.203125 0,0 0,-0.109375 -0.125,-0.109375 -0.328125,0 -0.6875,0.03125 -1.015625,0.03125 -0.34375,0 -0.71875,-0.03125 -1.046875,-0.03125 -0.0625,0 -0.171875,0 -0.171875,0.203125 C 5.21875,-6.5 5.3125,-6.5 5.390625,-6.5 c 0.578125,0.015625 0.6875,0.21875 0.6875,0.4375 0,0.03125 -0.03125,0.1875 -0.03125,0.203125 l -0.90625,3.5625 C 4.8125,-0.953125 3.65625,-0.09375 2.65625,-0.09375 c -0.671875,0 -1.203125,-0.4375 -1.203125,-1.296875 0,-0.015625 0,-0.328125 0.109375,-0.765625 L 2.515625,-6.046875 C 2.609375,-6.40625 2.625,-6.5 3.359375,-6.5 c 0.265625,0 0.34375,0 0.34375,-0.203125 0,-0.109375 -0.109375,-0.109375 -0.140625,-0.109375 -0.28125,0 -1,0.03125 -1.28125,0.03125 -0.28125,0 -1,-0.03125 -1.28125,-0.03125 -0.078125,0 -0.1875,0 -0.1875,0.203125 C 0.8125,-6.5 0.890625,-6.5 1.09375,-6.5 c 0.015625,0 0.203125,0 0.375,0.015625 0.171875,0.03125 0.265625,0.03125 0.265625,0.171875 0,0.046875 -0.109375,0.46875 -0.171875,0.703125 l -0.21875,0.875 C 1.25,-4.34375 0.78125,-2.46875 0.734375,-2.265625 0.671875,-2 0.671875,-1.84375 0.671875,-1.6875 c 0,1.203125 0.90625,1.90625 1.953125,1.90625 1.25,0 2.484375,-1.125 2.8125,-2.4375 z m 0,0"
               style="stroke:none"
               inkscape:connector-curvature="0" />
          </symbol>
          <symbol
             id="textext-ccf6af58-2"
             overflow="visible"
             style="overflow:visible">
            <path
               id="path1527"
               d=""
               style="stroke:none"
               inkscape:connector-curvature="0" />
          </symbol>
          <symbol
             id="textext-ccf6af58-3"
             overflow="visible"
             style="overflow:visible">
            <path
               id="path1530"
               d="m 2.328125,-4.4375 c 0,-0.1875 0,-0.1875 -0.203125,-0.1875 -0.453125,0.4375 -1.078125,0.4375 -1.359375,0.4375 v 0.25 c 0.15625,0 0.625,0 1,-0.1875 v 3.546875 c 0,0.234375 0,0.328125 -0.6875,0.328125 H 0.8125 V 0 c 0.125,0 0.984375,-0.03125 1.234375,-0.03125 0.21875,0 1.09375,0.03125 1.25,0.03125 V -0.25 H 3.03125 c -0.703125,0 -0.703125,-0.09375 -0.703125,-0.328125 z m 0,0"
               style="stroke:none"
               inkscape:connector-curvature="0" />
          </symbol>
          <symbol
             id="textext-ccf6af58-4"
             overflow="visible"
             style="overflow:visible">
            <path
               id="path1533"
               d="m 3.6875,-1.140625 v -0.25 H 2.90625 V -4.5 c 0,-0.140625 0,-0.203125 -0.140625,-0.203125 -0.09375,0 -0.125,0 -0.1875,0.109375 l -2.3125,3.203125 v 0.25 h 2.0625 v 0.5625 c 0,0.25 0,0.328125 -0.578125,0.328125 H 1.5625 V 0 C 1.921875,-0.015625 2.359375,-0.03125 2.609375,-0.03125 2.875,-0.03125 3.3125,-0.015625 3.671875,0 v -0.25 h -0.1875 C 2.90625,-0.25 2.90625,-0.328125 2.90625,-0.578125 v -0.5625 z M 2.375,-3.9375 v 2.546875 H 0.53125 Z m 0,0"
               style="stroke:none"
               inkscape:connector-curvature="0" />
          </symbol>
        </g>
      </defs>
      <g
         id="textext-ccf6af58-5"
         style="fill:#000082;fill-opacity:1">
        <g
           id="g1542"
           style="fill:#000082;fill-opacity:1">
          <use
             id="use1540"
             y="134.765"
             x="223.43201"
             xlink:href="#textext-ccf6af58-1"
             width="100%"
             height="100%"
             style="fill:#000082;fill-opacity:1" />
        </g>
        <g
           id="g1548"
           style="fill:#000082;fill-opacity:1">
          <use
             id="use1544"
             y="136.259"
             x="230.23399"
             xlink:href="#textext-ccf6af58-3"
             width="100%"
             height="100%"
             style="fill:#000082;fill-opacity:1" />
          <use
             id="use1546"
             y="136.259"
             x="234.20558"
             xlink:href="#textext-ccf6af58-4"
             width="100%"
             height="100%"
             style="fill:#000082;fill-opacity:1" />
        </g>
      </g>
    </g>
    <g
       id="g1726"
       ns0:preamble="/home/srl/Talks/2018/SOMME-18-04-2018/preamble.tex"
       ns0:text="$U_{45}$"
       transform="matrix(0.6296315,0,0,0.6296315,-122.3059,180.64958)"
       style="fill:#000082;fill-opacity:1">
      <defs
         id="defs1713">
        <g
           id="g1711">
          <symbol
             id="textext-55e5ad37-0"
             overflow="visible"
             style="overflow:visible">
            <path
               id="path1696"
               d=""
               style="stroke:none"
               inkscape:connector-curvature="0" />
          </symbol>
          <symbol
             id="textext-55e5ad37-1"
             overflow="visible"
             style="overflow:visible">
            <path
               id="path1699"
               d="M 6.328125,-5.765625 C 6.4375,-6.171875 6.609375,-6.46875 7.40625,-6.5 c 0.046875,0 0.171875,-0.015625 0.171875,-0.203125 0,0 0,-0.109375 -0.125,-0.109375 -0.328125,0 -0.6875,0.03125 -1.015625,0.03125 -0.34375,0 -0.71875,-0.03125 -1.046875,-0.03125 -0.0625,0 -0.171875,0 -0.171875,0.203125 C 5.21875,-6.5 5.3125,-6.5 5.390625,-6.5 c 0.578125,0.015625 0.6875,0.21875 0.6875,0.4375 0,0.03125 -0.03125,0.1875 -0.03125,0.203125 l -0.90625,3.5625 C 4.8125,-0.953125 3.65625,-0.09375 2.65625,-0.09375 c -0.671875,0 -1.203125,-0.4375 -1.203125,-1.296875 0,-0.015625 0,-0.328125 0.109375,-0.765625 L 2.515625,-6.046875 C 2.609375,-6.40625 2.625,-6.5 3.359375,-6.5 c 0.265625,0 0.34375,0 0.34375,-0.203125 0,-0.109375 -0.109375,-0.109375 -0.140625,-0.109375 -0.28125,0 -1,0.03125 -1.28125,0.03125 -0.28125,0 -1,-0.03125 -1.28125,-0.03125 -0.078125,0 -0.1875,0 -0.1875,0.203125 C 0.8125,-6.5 0.890625,-6.5 1.09375,-6.5 c 0.015625,0 0.203125,0 0.375,0.015625 0.171875,0.03125 0.265625,0.03125 0.265625,0.171875 0,0.046875 -0.109375,0.46875 -0.171875,0.703125 l -0.21875,0.875 C 1.25,-4.34375 0.78125,-2.46875 0.734375,-2.265625 0.671875,-2 0.671875,-1.84375 0.671875,-1.6875 c 0,1.203125 0.90625,1.90625 1.953125,1.90625 1.25,0 2.484375,-1.125 2.8125,-2.4375 z m 0,0"
               style="stroke:none"
               inkscape:connector-curvature="0" />
          </symbol>
          <symbol
             id="textext-55e5ad37-2"
             overflow="visible"
             style="overflow:visible">
            <path
               id="path1702"
               d=""
               style="stroke:none"
               inkscape:connector-curvature="0" />
          </symbol>
          <symbol
             id="textext-55e5ad37-3"
             overflow="visible"
             style="overflow:visible">
            <path
               id="path1705"
               d="m 3.6875,-1.140625 v -0.25 H 2.90625 V -4.5 c 0,-0.140625 0,-0.203125 -0.140625,-0.203125 -0.09375,0 -0.125,0 -0.1875,0.109375 l -2.3125,3.203125 v 0.25 h 2.0625 v 0.5625 c 0,0.25 0,0.328125 -0.578125,0.328125 H 1.5625 V 0 C 1.921875,-0.015625 2.359375,-0.03125 2.609375,-0.03125 2.875,-0.03125 3.3125,-0.015625 3.671875,0 v -0.25 h -0.1875 C 2.90625,-0.25 2.90625,-0.328125 2.90625,-0.578125 v -0.5625 z M 2.375,-3.9375 v 2.546875 H 0.53125 Z m 0,0"
               style="stroke:none"
               inkscape:connector-curvature="0" />
          </symbol>
          <symbol
             id="textext-55e5ad37-4"
             overflow="visible"
             style="overflow:visible">
            <path
               id="path1708"
               d="m 1.078125,-3.890625 c 0.359375,0.09375 0.5625,0.09375 0.671875,0.09375 0.921875,0 1.46875,-0.625 1.46875,-0.734375 0,-0.078125 -0.046875,-0.09375 -0.078125,-0.09375 -0.015625,0 -0.03125,0 -0.0625,0.015625 -0.171875,0.0625 -0.53125,0.203125 -1.046875,0.203125 -0.203125,0 -0.5625,-0.015625 -1.015625,-0.1875 C 0.9375,-4.625 0.921875,-4.625 0.921875,-4.625 c -0.09375,0 -0.09375,0.078125 -0.09375,0.1875 v 2.046875 c 0,0.125 0,0.203125 0.109375,0.203125 0.0625,0 0.078125,0 0.140625,-0.09375 0.296875,-0.375 0.734375,-0.4375 0.96875,-0.4375 0.421875,0 0.609375,0.328125 0.640625,0.390625 0.125,0.234375 0.171875,0.5 0.171875,0.90625 0,0.203125 0,0.609375 -0.21875,0.921875 -0.171875,0.25 -0.46875,0.421875 -0.8125,0.421875 -0.453125,0 -0.921875,-0.25 -1.09375,-0.71875 0.265625,0.015625 0.40625,-0.15625 0.40625,-0.34375 0,-0.296875 -0.265625,-0.34375 -0.359375,-0.34375 0,0 -0.34375,0 -0.34375,0.375 0,0.625 0.578125,1.25 1.40625,1.25 0.890625,0 1.671875,-0.65625 1.671875,-1.546875 0,-0.78125 -0.59375,-1.5 -1.453125,-1.5 -0.3125,0 -0.671875,0.0625 -0.984375,0.328125 z m 0,0"
               style="stroke:none"
               inkscape:connector-curvature="0" />
          </symbol>
        </g>
      </defs>
      <g
         id="textext-55e5ad37-5"
         style="fill:#000082;fill-opacity:1">
        <g
           id="g1717"
           style="fill:#000082;fill-opacity:1">
          <use
             id="use1715"
             y="134.765"
             x="223.43201"
             xlink:href="#textext-55e5ad37-1"
             width="100%"
             height="100%"
             style="fill:#000082;fill-opacity:1" />
        </g>
        <g
           id="g1723"
           style="fill:#000082;fill-opacity:1">
          <use
             id="use1719"
             y="136.259"
             x="230.23399"
             xlink:href="#textext-55e5ad37-3"
             width="100%"
             height="100%"
             style="fill:#000082;fill-opacity:1" />
          <use
             id="use1721"
             y="136.259"
             x="234.20558"
             xlink:href="#textext-55e5ad37-4"
             width="100%"
             height="100%"
             style="fill:#000082;fill-opacity:1" />
        </g>
      </g>
    </g>
    <g
       id="g1920"
       ns0:preamble="/home/srl/Talks/2018/SOMME-18-04-2018/preamble.tex"
       ns0:text="$U_{25}$"
       transform="matrix(0.58970211,0,0,0.58970211,-98.231622,198.56747)"
       style="fill:#000080">
      <defs
         id="defs1907">
        <g
           id="g1905">
          <symbol
             id="textext-e072c854-0"
             overflow="visible"
             style="overflow:visible">
            <path
               id="path1890"
               d=""
               style="stroke:none"
               inkscape:connector-curvature="0" />
          </symbol>
          <symbol
             id="textext-e072c854-1"
             overflow="visible"
             style="overflow:visible">
            <path
               id="path1893"
               d="M 6.328125,-5.765625 C 6.4375,-6.171875 6.609375,-6.46875 7.40625,-6.5 c 0.046875,0 0.171875,-0.015625 0.171875,-0.203125 0,0 0,-0.109375 -0.125,-0.109375 -0.328125,0 -0.6875,0.03125 -1.015625,0.03125 -0.34375,0 -0.71875,-0.03125 -1.046875,-0.03125 -0.0625,0 -0.171875,0 -0.171875,0.203125 C 5.21875,-6.5 5.3125,-6.5 5.390625,-6.5 c 0.578125,0.015625 0.6875,0.21875 0.6875,0.4375 0,0.03125 -0.03125,0.1875 -0.03125,0.203125 l -0.90625,3.5625 C 4.8125,-0.953125 3.65625,-0.09375 2.65625,-0.09375 c -0.671875,0 -1.203125,-0.4375 -1.203125,-1.296875 0,-0.015625 0,-0.328125 0.109375,-0.765625 L 2.515625,-6.046875 C 2.609375,-6.40625 2.625,-6.5 3.359375,-6.5 c 0.265625,0 0.34375,0 0.34375,-0.203125 0,-0.109375 -0.109375,-0.109375 -0.140625,-0.109375 -0.28125,0 -1,0.03125 -1.28125,0.03125 -0.28125,0 -1,-0.03125 -1.28125,-0.03125 -0.078125,0 -0.1875,0 -0.1875,0.203125 C 0.8125,-6.5 0.890625,-6.5 1.09375,-6.5 c 0.015625,0 0.203125,0 0.375,0.015625 0.171875,0.03125 0.265625,0.03125 0.265625,0.171875 0,0.046875 -0.109375,0.46875 -0.171875,0.703125 l -0.21875,0.875 C 1.25,-4.34375 0.78125,-2.46875 0.734375,-2.265625 0.671875,-2 0.671875,-1.84375 0.671875,-1.6875 c 0,1.203125 0.90625,1.90625 1.953125,1.90625 1.25,0 2.484375,-1.125 2.8125,-2.4375 z m 0,0"
               style="stroke:none"
               inkscape:connector-curvature="0" />
          </symbol>
          <symbol
             id="textext-e072c854-2"
             overflow="visible"
             style="overflow:visible">
            <path
               id="path1896"
               d=""
               style="stroke:none"
               inkscape:connector-curvature="0" />
          </symbol>
          <symbol
             id="textext-e072c854-3"
             overflow="visible"
             style="overflow:visible">
            <path
               id="path1899"
               d="M 3.515625,-1.265625 H 3.28125 c -0.015625,0.15625 -0.09375,0.5625 -0.1875,0.625 C 3.046875,-0.59375 2.515625,-0.59375 2.40625,-0.59375 H 1.125 c 0.734375,-0.640625 0.984375,-0.84375 1.390625,-1.171875 0.515625,-0.40625 1,-0.84375 1,-1.5 0,-0.84375 -0.734375,-1.359375 -1.625,-1.359375 -0.859375,0 -1.453125,0.609375 -1.453125,1.25 0,0.34375 0.296875,0.390625 0.375,0.390625 0.15625,0 0.359375,-0.125 0.359375,-0.375 0,-0.125 -0.046875,-0.375 -0.40625,-0.375 C 0.984375,-4.21875 1.453125,-4.375 1.78125,-4.375 c 0.703125,0 1.0625,0.546875 1.0625,1.109375 0,0.609375 -0.4375,1.078125 -0.65625,1.328125 L 0.515625,-0.265625 C 0.4375,-0.203125 0.4375,-0.1875 0.4375,0 h 2.875 z m 0,0"
               style="stroke:none"
               inkscape:connector-curvature="0" />
          </symbol>
          <symbol
             id="textext-e072c854-4"
             overflow="visible"
             style="overflow:visible">
            <path
               id="path1902"
               d="m 1.078125,-3.890625 c 0.359375,0.09375 0.5625,0.09375 0.671875,0.09375 0.921875,0 1.46875,-0.625 1.46875,-0.734375 0,-0.078125 -0.046875,-0.09375 -0.078125,-0.09375 -0.015625,0 -0.03125,0 -0.0625,0.015625 -0.171875,0.0625 -0.53125,0.203125 -1.046875,0.203125 -0.203125,0 -0.5625,-0.015625 -1.015625,-0.1875 C 0.9375,-4.625 0.921875,-4.625 0.921875,-4.625 c -0.09375,0 -0.09375,0.078125 -0.09375,0.1875 v 2.046875 c 0,0.125 0,0.203125 0.109375,0.203125 0.0625,0 0.078125,0 0.140625,-0.09375 0.296875,-0.375 0.734375,-0.4375 0.96875,-0.4375 0.421875,0 0.609375,0.328125 0.640625,0.390625 0.125,0.234375 0.171875,0.5 0.171875,0.90625 0,0.203125 0,0.609375 -0.21875,0.921875 -0.171875,0.25 -0.46875,0.421875 -0.8125,0.421875 -0.453125,0 -0.921875,-0.25 -1.09375,-0.71875 0.265625,0.015625 0.40625,-0.15625 0.40625,-0.34375 0,-0.296875 -0.265625,-0.34375 -0.359375,-0.34375 0,0 -0.34375,0 -0.34375,0.375 0,0.625 0.578125,1.25 1.40625,1.25 0.890625,0 1.671875,-0.65625 1.671875,-1.546875 0,-0.78125 -0.59375,-1.5 -1.453125,-1.5 -0.3125,0 -0.671875,0.0625 -0.984375,0.328125 z m 0,0"
               style="stroke:none"
               inkscape:connector-curvature="0" />
          </symbol>
        </g>
      </defs>
      <g
         id="textext-e072c854-5"
         style="fill:#000080">
        <g
           id="g1911"
           style="fill:#000080;fill-opacity:1">
          <use
             id="use1909"
             y="134.765"
             x="223.43201"
             xlink:href="#textext-e072c854-1"
             width="100%"
             height="100%"
             style="fill:#000080" />
        </g>
        <g
           id="g1917"
           style="fill:#000080;fill-opacity:1">
          <use
             id="use1913"
             y="136.259"
             x="230.23399"
             xlink:href="#textext-e072c854-3"
             width="100%"
             height="100%"
             style="fill:#000080" />
          <use
             id="use1915"
             y="136.259"
             x="234.20558"
             xlink:href="#textext-e072c854-4"
             width="100%"
             height="100%"
             style="fill:#000080" />
        </g>
      </g>
    </g>
    <path
       style="fill:#00007c;fill-opacity:1;stroke:#000084;stroke-width:0.40000001;stroke-linecap:butt;stroke-linejoin:miter;stroke-miterlimit:4;stroke-dasharray:none;stroke-opacity:1;marker-end:url(#marker2210)"
       d="m -3,273.88258 h 1.5615842"
       id="path1943"
       inkscape:connector-curvature="0"
       inkscape:path-effect="#path-effect1945"
       inkscape:original-d="m -3,273.88258 c 4.1785204,-2.6e-4 -2.6164064,-2.6e-4 1.5615842,0"
       sodipodi:nodetypes="cc"
       transform="translate(26.199716,-4.7262232)" />
    <path
       style="fill:#00007c;fill-opacity:1;stroke:#000084;stroke-width:0.40000001;stroke-linecap:butt;stroke-linejoin:miter;stroke-miterlimit:4;stroke-dasharray:none;stroke-opacity:1;marker-end:url(#marker2210-4)"
       d="m -3,273.88258 h 1.5615842"
       id="path1943-4"
       inkscape:connector-curvature="0"
       inkscape:path-effect="#path-effect1945-2"
       inkscape:original-d="m -3,273.88258 c 4.1785204,-2.6e-4 -2.6164064,-2.6e-4 1.5615842,0"
       sodipodi:nodetypes="cc"
       transform="translate(44.90326,13.253978)" />
    <path
       style="fill:#00007c;fill-opacity:1;stroke:#000084;stroke-width:0.40000001;stroke-linecap:butt;stroke-linejoin:miter;stroke-miterlimit:4;stroke-dasharray:none;stroke-opacity:1;marker-end:url(#marker2210-5)"
       d="m -3,273.88258 h 1.5615842"
       id="path1943-5"
       inkscape:connector-curvature="0"
       inkscape:path-effect="#path-effect1945-7"
       inkscape:original-d="m -3,273.88258 c 4.1785204,-2.6e-4 -2.6164064,-2.6e-4 1.5615842,0"
       sodipodi:nodetypes="cc"
       transform="translate(26.409342,13.04849)" />
    <path
       style="fill:#00007c;fill-opacity:1;stroke:#000084;stroke-width:0.40000001;stroke-linecap:butt;stroke-linejoin:miter;stroke-miterlimit:4;stroke-dasharray:none;stroke-opacity:1;marker-end:url(#marker2210-7)"
       d="m -3,273.88258 h 1.5615842"
       id="path1943-8"
       inkscape:connector-curvature="0"
       inkscape:path-effect="#path-effect1945-9"
       inkscape:original-d="m -3,273.88258 c 4.1785204,-2.6e-4 -2.6164064,-2.6e-4 1.5615842,0"
       sodipodi:nodetypes="cc"
       transform="rotate(-90,5.7455217,266.84255)" />
    <path
       style="fill:#00007c;fill-opacity:1;stroke:#000084;stroke-width:0.40000001;stroke-linecap:butt;stroke-linejoin:miter;stroke-miterlimit:4;stroke-dasharray:none;stroke-opacity:1;marker-end:url(#marker2210-7-1)"
       d="m -3,273.88258 h 1.5615842"
       id="path1943-8-3"
       inkscape:connector-curvature="0"
       inkscape:path-effect="#path-effect1945-9-3"
       inkscape:original-d="m -3,273.88258 c 4.1785204,-2.6e-4 -2.6164064,-2.6e-4 1.5615842,0"
       sodipodi:nodetypes="cc"
       transform="rotate(-90,14.998554,258.36618)" />
    <g
       id="g2505"
       ns0:preamble="/home/srl/Talks/2018/SOMME-18-04-2018/preamble.tex"
       ns0:text="$V_5$"
       transform="matrix(0.64834264,0,0,0.64834264,-103.66242,177.19348)"
       style="stroke:#009f00;stroke-opacity:1;fill:#009900;fill-opacity:1">
      <defs
         id="defs2494">
        <g
           id="g2492">
          <symbol
             id="textext-4902ba1f-0"
             overflow="visible"
             style="overflow:visible">
            <path
               id="path2480"
               d=""
               style="stroke:none"
               inkscape:connector-curvature="0" />
          </symbol>
          <symbol
             id="textext-4902ba1f-1"
             overflow="visible"
             style="overflow:visible">
            <path
               id="path2483"
               d="M 6.265625,-5.671875 C 6.75,-6.453125 7.171875,-6.484375 7.53125,-6.5 c 0.125,-0.015625 0.140625,-0.171875 0.140625,-0.1875 0,-0.078125 -0.0625,-0.125 -0.140625,-0.125 -0.25,0 -0.546875,0.03125 -0.8125,0.03125 -0.328125,0 -0.671875,-0.03125 -0.984375,-0.03125 -0.0625,0 -0.1875,0 -0.1875,0.1875 0,0.109375 0.078125,0.125 0.15625,0.125 0.265625,0.015625 0.453125,0.125 0.453125,0.328125 0,0.15625 -0.140625,0.375 -0.140625,0.375 l -3.0625,4.875 -0.6875,-5.28125 C 2.265625,-6.375 2.5,-6.5 2.953125,-6.5 c 0.140625,0 0.25,0 0.25,-0.203125 0,-0.078125 -0.078125,-0.109375 -0.125,-0.109375 -0.40625,0 -0.828125,0.03125 -1.25,0.03125 -0.171875,0 -0.359375,0 -0.546875,0 -0.171875,0 -0.359375,-0.03125 -0.53125,-0.03125 -0.078125,0 -0.1875,0 -0.1875,0.1875 0,0.125 0.078125,0.125 0.25,0.125 0.546875,0 0.5625,0.09375 0.59375,0.34375 L 2.1875,-0.015625 C 2.21875,0.1875 2.265625,0.21875 2.390625,0.21875 c 0.15625,0 0.203125,-0.046875 0.28125,-0.171875 z m 0,0"
               style="stroke:none"
               inkscape:connector-curvature="0" />
          </symbol>
          <symbol
             id="textext-4902ba1f-2"
             overflow="visible"
             style="overflow:visible">
            <path
               id="path2486"
               d=""
               style="stroke:none"
               inkscape:connector-curvature="0" />
          </symbol>
          <symbol
             id="textext-4902ba1f-3"
             overflow="visible"
             style="overflow:visible">
            <path
               id="path2489"
               d="m 1.078125,-3.890625 c 0.359375,0.09375 0.5625,0.09375 0.671875,0.09375 0.921875,0 1.46875,-0.625 1.46875,-0.734375 0,-0.078125 -0.046875,-0.09375 -0.078125,-0.09375 -0.015625,0 -0.03125,0 -0.0625,0.015625 -0.171875,0.0625 -0.53125,0.203125 -1.046875,0.203125 -0.203125,0 -0.5625,-0.015625 -1.015625,-0.1875 C 0.9375,-4.625 0.921875,-4.625 0.921875,-4.625 c -0.09375,0 -0.09375,0.078125 -0.09375,0.1875 v 2.046875 c 0,0.125 0,0.203125 0.109375,0.203125 0.0625,0 0.078125,0 0.140625,-0.09375 0.296875,-0.375 0.734375,-0.4375 0.96875,-0.4375 0.421875,0 0.609375,0.328125 0.640625,0.390625 0.125,0.234375 0.171875,0.5 0.171875,0.90625 0,0.203125 0,0.609375 -0.21875,0.921875 -0.171875,0.25 -0.46875,0.421875 -0.8125,0.421875 -0.453125,0 -0.921875,-0.25 -1.09375,-0.71875 0.265625,0.015625 0.40625,-0.15625 0.40625,-0.34375 0,-0.296875 -0.265625,-0.34375 -0.359375,-0.34375 0,0 -0.34375,0 -0.34375,0.375 0,0.625 0.578125,1.25 1.40625,1.25 0.890625,0 1.671875,-0.65625 1.671875,-1.546875 0,-0.78125 -0.59375,-1.5 -1.453125,-1.5 -0.3125,0 -0.671875,0.0625 -0.984375,0.328125 z m 0,0"
               style="stroke:none"
               inkscape:connector-curvature="0" />
          </symbol>
        </g>
      </defs>
      <g
         id="textext-4902ba1f-4"
         style="stroke:#009f00;stroke-opacity:1;fill:#009900;fill-opacity:1">
        <g
           id="g2498"
           style="fill:#009900;fill-opacity:1;stroke:#009f00;stroke-opacity:1">
          <use
             id="use2496"
             y="134.765"
             x="223.43201"
             xlink:href="#textext-4902ba1f-1"
             width="100%"
             height="100%"
             style="stroke:#009f00;stroke-opacity:1;fill:#009900;fill-opacity:1" />
        </g>
        <g
           id="g2502"
           style="fill:#009900;fill-opacity:1;stroke:#009f00;stroke-opacity:1">
          <use
             id="use2500"
             y="136.259"
             x="229.244"
             xlink:href="#textext-4902ba1f-3"
             width="100%"
             height="100%"
             style="stroke:#009f00;stroke-opacity:1;fill:#009900;fill-opacity:1" />
        </g>
      </g>
    </g>
    <circle
       style="fill:#009900;fill-opacity:1;stroke:none;stroke-width:0.40000001;stroke-linecap:round;stroke-linejoin:miter;stroke-miterlimit:4;stroke-dasharray:none;stroke-dashoffset:0;stroke-opacity:1;paint-order:normal"
       id="path2527"
       cx="12.63751"
       cy="286.82834"
       r="1.2329278" />
    <circle
       style="fill:#009900;fill-opacity:1;stroke:#009f00;stroke-width:0.40000001;stroke-linecap:round;stroke-linejoin:miter;stroke-miterlimit:4;stroke-dasharray:none;stroke-dashoffset:0;stroke-opacity:1;paint-order:normal"
       id="path2527-7"
       cx="30.41222"
       cy="269.15634"
       r="1.2329278" />
    <path
       style="fill:#009900;stroke:#009f00;stroke-width:0.265;stroke-linecap:butt;stroke-linejoin:miter;stroke-opacity:1;stroke-miterlimit:4;stroke-dasharray:none;marker-end:url(#marker2549);fill-opacity:1"
       d="m 9.2469585,290.01339 3.4014505,-2.96511"
       id="path2544"
       inkscape:connector-curvature="0"
       inkscape:path-effect="#path-effect2546"
       inkscape:original-d="m 9.2469585,290.01339 c 1.1340815,-0.98863 2.2678975,-1.97701 3.4014505,-2.96511"
       transform="translate(-1.3356718,1.0274398)" />
    <path
       style="fill:#009900;stroke:#009f00;stroke-width:0.26499999;stroke-linecap:butt;stroke-linejoin:miter;stroke-miterlimit:4;stroke-dasharray:none;stroke-opacity:1;marker-end:url(#marker2549-9);fill-opacity:1"
       d="m 14.795134,287.34205 -7.7976441,3.6105"
       id="path2544-7"
       inkscape:connector-curvature="0"
       inkscape:path-effect="#path-effect2546-6"
       inkscape:original-d="m 14.795134,287.34205 c 1.134081,-0.98863 -8.9311971,4.5986 -7.7976441,3.6105"
       transform="translate(25.270391,-23.77357)"
       sodipodi:nodetypes="cc" />
  </g>
</svg>
