<?xml version="1.0" encoding="UTF-8" standalone="no"?>
<svg
   xmlns:dc="http://purl.org/dc/elements/1.1/"
   xmlns:cc="http://creativecommons.org/ns#"
   xmlns:rdf="http://www.w3.org/1999/02/22-rdf-syntax-ns#"
   xmlns:svg="http://www.w3.org/2000/svg"
   xmlns="http://www.w3.org/2000/svg"
   xmlns:sodipodi="http://sodipodi.sourceforge.net/DTD/sodipodi-0.dtd"
   xmlns:inkscape="http://www.inkscape.org/namespaces/inkscape"
   width="8in"
   height="6in"
   viewBox="0 0 203.2 152.4"
   version="1.1"
   id="svg8"
   inkscape:version="1.0.1 (3bc2e813f5, 2020-09-07)"
   sodipodi:docname="picture1.svg">
  <defs
     id="defs2" />
  <sodipodi:namedview
     id="base"
     pagecolor="#ffffff"
     bordercolor="#666666"
     borderopacity="1.0"
     inkscape:pageopacity="0.0"
     inkscape:pageshadow="2"
     inkscape:zoom="0.70264115"
     inkscape:cx="391.48829"
     inkscape:cy="294.97426"
     inkscape:document-units="mm"
     inkscape:current-layer="layer1"
     inkscape:document-rotation="0"
     showgrid="false"
     inkscape:window-width="1366"
     inkscape:window-height="723"
     inkscape:window-x="0"
     inkscape:window-y="0"
     inkscape:window-maximized="1"
     units="in" />
  <metadata
     id="metadata5">
    <rdf:RDF>
      <cc:Work
         rdf:about="">
        <dc:format>image/svg+xml</dc:format>
        <dc:type
           rdf:resource="http://purl.org/dc/dcmitype/StillImage" />
        <dc:title></dc:title>
      </cc:Work>
    </rdf:RDF>
  </metadata>
  <g
     inkscape:label="Layer 1"
     inkscape:groupmode="layer"
     id="layer1">
    <path
       style="fill:none;stroke:#000000;stroke-width:0.56023;stroke-linecap:butt;stroke-linejoin:miter;stroke-miterlimit:4;stroke-dasharray:none;stroke-opacity:1"
       d="M 34.890975,3.8864745 V 125.63427 H 196.74584"
       id="path910" />
    <text
       xml:space="preserve"
       style="font-size:8.99873px;line-height:1.25;font-family:sans-serif;letter-spacing:0px;word-spacing:0px;stroke-width:0.482072"
       x="-87.810959"
       y="10.024633"
       id="text914"
       transform="rotate(-90)"><tspan
         sodipodi:role="line"
         id="tspan912"
         x="-87.810959"
         y="10.024633"
         style="stroke-width:0.482072">Question</tspan></text>
    <text
       xml:space="preserve"
       style="font-size:9.15711px;line-height:1.25;font-family:sans-serif;letter-spacing:0px;word-spacing:0px;stroke-width:0.490558"
       x="102.5534"
       y="148.19312"
       id="text918"><tspan
         sodipodi:role="line"
         id="tspan916"
         x="102.5534"
         y="148.19312"
         style="stroke-width:0.490558">Theory</tspan></text>
    <text
       xml:space="preserve"
       style="font-size:4.9389px;line-height:1.25;font-family:sans-serif;letter-spacing:0px;word-spacing:0px;stroke-width:0.264583"
       x="-67.742744"
       y="64.579208"
       id="text922"
       transform="rotate(-58.324)"><tspan
         id="tspan920"
         x="-67.742744"
         y="64.579208"
         style="stroke-width:0.264583"
         sodipodi:role="line">Scattering</tspan></text>
    <text
       xml:space="preserve"
       style="font-size:7.08089px;line-height:1.25;font-family:sans-serif;letter-spacing:0px;word-spacing:0px;stroke-width:0.379332"
       x="77.426941"
       y="36.687149"
       id="text926"><tspan
         sodipodi:role="line"
         id="tspan924"
         x="77.426941"
         y="36.687149"
         style="stroke-width:0.379332">JKLP</tspan></text>
    <text
       xml:space="preserve"
       style="font-size:4.9389px;line-height:1.25;font-family:sans-serif;letter-spacing:0px;word-spacing:0px;stroke-width:0.264583"
       x="43.787956"
       y="133.2023"
       id="text930"><tspan
         sodipodi:role="line"
         id="tspan928"
         x="43.787956"
         y="133.2023"
         style="stroke-width:0.264583">Free</tspan></text>
    <text
       xml:space="preserve"
       style="font-size:4.9389px;line-height:1.25;font-family:sans-serif;letter-spacing:0px;word-spacing:0px;stroke-width:0.264583"
       x="79.401596"
       y="132.95181"
       id="text934"><tspan
         sodipodi:role="line"
         id="tspan932"
         x="79.401596"
         y="132.95181"
         style="stroke-width:0.264583">Perturbative ϕ⁴</tspan></text>
    <text
       xml:space="preserve"
       style="font-size:4.9389px;line-height:1.25;font-family:sans-serif;letter-spacing:0px;word-spacing:0px;stroke-width:0.264583"
       x="169.58199"
       y="133.67358"
       id="text938"><tspan
         sodipodi:role="line"
         id="tspan936"
         x="169.58199"
         y="133.67358"
         style="stroke-width:0.264583">QCD</tspan></text>
    <text
       xml:space="preserve"
       style="font-size:4.9389px;line-height:1.25;font-family:sans-serif;letter-spacing:0px;word-spacing:0px;stroke-width:0.264583"
       x="-30.032949"
       y="43.304676"
       id="text922-3"
       transform="rotate(-58.324001)"><tspan
         id="tspan920-6"
         x="-30.032949"
         y="43.304676"
         style="stroke-width:0.264583"
         sodipodi:role="line">Sources</tspan></text>
    <text
       xml:space="preserve"
       style="font-size:8.4578px;line-height:1.25;font-family:sans-serif;letter-spacing:0px;word-spacing:0px;fill:#0000ff;stroke-width:0.453095"
       x="43.330059"
       y="53.646698"
       id="text960"><tspan
         sodipodi:role="line"
         id="tspan958"
         x="43.330059"
         y="53.646698"
         style="fill:#0000ff;stroke-width:0.453095">(BPP)</tspan></text>
    <text
       xml:space="preserve"
       style="font-size:8.06877px;line-height:1.25;font-family:sans-serif;letter-spacing:0px;word-spacing:0px;fill:#d40000;stroke-width:0.432254"
       x="51.108253"
       y="21.376247"
       id="text964"><tspan
         sodipodi:role="line"
         id="tspan962"
         x="51.108253"
         y="21.376247"
         style="fill:#d40000;stroke-width:0.432254">(BQP)</tspan></text>
    <text
       xml:space="preserve"
       style="font-size:4.9389px;line-height:1.25;font-family:sans-serif;text-align:center;letter-spacing:0px;word-spacing:0px;text-anchor:middle;stroke-width:0.264583"
       x="86.62114"
       y="72.419807"
       id="text968"><tspan
         sodipodi:role="line"
         id="tspan966"
         x="86.62114"
         y="72.419807"
         style="text-align:center;text-anchor:middle;stroke-width:0.264583">Perturbative</tspan><tspan
         sodipodi:role="line"
         x="86.62114"
         y="78.59343"
         style="text-align:center;text-anchor:middle;stroke-width:0.264583"
         id="tspan970">S-Matrix</tspan></text>
    <path
       style="fill:none;stroke:#000000;stroke-width:0.35277778;stroke-linecap:butt;stroke-linejoin:miter;stroke-opacity:1;stroke-miterlimit:4;stroke-dasharray:none"
       d="M 51.077129,32.585546 C 71.698677,49.602856 116.3698,66.410077 138.24005,69.395551"
       id="path972"
       sodipodi:nodetypes="cc" />
  </g>
</svg>
