<?xml version="1.0" encoding="UTF-8" standalone="no"?>
<!-- Created with Inkscape (http://www.inkscape.org/) -->

<svg
   xmlns:ns0="http://www.iki.fi/pav/software/textext/"
   xmlns:dc="http://purl.org/dc/elements/1.1/"
   xmlns:cc="http://creativecommons.org/ns#"
   xmlns:rdf="http://www.w3.org/1999/02/22-rdf-syntax-ns#"
   xmlns:svg="http://www.w3.org/2000/svg"
   xmlns="http://www.w3.org/2000/svg"
   xmlns:xlink="http://www.w3.org/1999/xlink"
   xmlns:sodipodi="http://sodipodi.sourceforge.net/DTD/sodipodi-0.dtd"
   xmlns:inkscape="http://www.inkscape.org/namespaces/inkscape"
   width="2in"
   height="2in"
   viewBox="0 0 50.800001 50.800001"
   version="1.1"
   id="svg8"
   inkscape:version="0.92.4 5da689c313, 2019-01-14"
   sodipodi:docname="lattice3.svg">
  <defs
     id="defs2">
    <marker
       inkscape:stockid="Arrow1Lend"
       orient="auto"
       refY="0.0"
       refX="0.0"
       id="marker1577"
       style="overflow:visible;"
       inkscape:isstock="true">
      <path
         id="path1317"
         d="M 0.0,0.0 L 5.0,-5.0 L -12.5,0.0 L 5.0,5.0 L 0.0,0.0 z "
         style="fill-rule:evenodd;stroke:#0000b6;stroke-width:1pt;stroke-opacity:1;fill:#0000b6;fill-opacity:1"
         transform="scale(0.8) rotate(180) translate(12.5,0)" />
    </marker>
    <inkscape:path-effect
       effect="spiro"
       id="path-effect1312"
       is_visible="true" />
    <marker
       inkscape:stockid="Arrow1Lend"
       orient="auto"
       refY="0.0"
       refX="0.0"
       id="marker2404"
       style="overflow:visible;"
       inkscape:isstock="true">
      <path
         id="path2402"
         d="M 0.0,0.0 L 5.0,-5.0 L -12.5,0.0 L 5.0,5.0 L 0.0,0.0 z "
         style="fill-rule:evenodd;stroke:#0000cb;stroke-width:1pt;stroke-opacity:1;fill:#0000cb;fill-opacity:1"
         transform="scale(0.8) rotate(180) translate(12.5,0)" />
    </marker>
    <marker
       inkscape:stockid="Arrow1Lstart"
       orient="auto"
       refY="0.0"
       refX="0.0"
       id="Arrow1Lstart"
       style="overflow:visible"
       inkscape:isstock="true">
      <path
         id="path817"
         d="M 0.0,0.0 L 5.0,-5.0 L -12.5,0.0 L 5.0,5.0 L 0.0,0.0 z "
         style="fill-rule:evenodd;stroke:#000000;stroke-width:1pt;stroke-opacity:1;fill:#000000;fill-opacity:1"
         transform="scale(0.8) translate(12.5,0)" />
    </marker>
    <marker
       inkscape:stockid="Arrow1Mend"
       orient="auto"
       refY="0.0"
       refX="0.0"
       id="Arrow1Mend"
       style="overflow:visible;"
       inkscape:isstock="true">
      <path
         id="path826"
         d="M 0.0,0.0 L 5.0,-5.0 L -12.5,0.0 L 5.0,5.0 L 0.0,0.0 z "
         style="fill-rule:evenodd;stroke:#000000;stroke-width:1pt;stroke-opacity:1;fill:#000000;fill-opacity:1"
         transform="scale(0.4) rotate(180) translate(10,0)" />
    </marker>
    <marker
       inkscape:stockid="Arrow1Mstart"
       orient="auto"
       refY="0.0"
       refX="0.0"
       id="Arrow1Mstart"
       style="overflow:visible"
       inkscape:isstock="true">
      <path
         id="path823"
         d="M 0.0,0.0 L 5.0,-5.0 L -12.5,0.0 L 5.0,5.0 L 0.0,0.0 z "
         style="fill-rule:evenodd;stroke:#000000;stroke-width:1pt;stroke-opacity:1;fill:#000000;fill-opacity:1"
         transform="scale(0.4) translate(10,0)" />
    </marker>
    <marker
       inkscape:stockid="Arrow1Lend"
       orient="auto"
       refY="0.0"
       refX="0.0"
       id="Arrow1Lend"
       style="overflow:visible;"
       inkscape:isstock="true">
      <path
         id="path820"
         d="M 0.0,0.0 L 5.0,-5.0 L -12.5,0.0 L 5.0,5.0 L 0.0,0.0 z "
         style="fill-rule:evenodd;stroke:#0000cb;stroke-width:1pt;stroke-opacity:1;fill:#0000cb;fill-opacity:1"
         transform="scale(0.8) rotate(180) translate(12.5,0)" />
    </marker>
    <marker
       inkscape:stockid="Arrow1Lend"
       orient="auto"
       refY="0"
       refX="0"
       id="marker2404-8"
       style="overflow:visible"
       inkscape:isstock="true">
      <path
         inkscape:connector-curvature="0"
         id="path2402-0"
         d="M 0,0 5,-5 -12.5,0 5,5 Z"
         style="fill:#0000cb;fill-opacity:1;fill-rule:evenodd;stroke:#0000cb;stroke-width:1.00000003pt;stroke-opacity:1"
         transform="matrix(-0.8,0,0,-0.8,-10,0)" />
    </marker>
    <marker
       inkscape:stockid="Arrow1Lend"
       orient="auto"
       refY="0"
       refX="0"
       id="marker2404-2"
       style="overflow:visible"
       inkscape:isstock="true">
      <path
         inkscape:connector-curvature="0"
         id="path2402-9"
         d="M 0,0 5,-5 -12.5,0 5,5 Z"
         style="fill:#0000cb;fill-opacity:1;fill-rule:evenodd;stroke:#0000cb;stroke-width:1.00000003pt;stroke-opacity:1"
         transform="matrix(-0.8,0,0,-0.8,-10,0)" />
    </marker>
    <marker
       inkscape:stockid="Arrow1Lend"
       orient="auto"
       refY="0"
       refX="0"
       id="marker2404-1"
       style="overflow:visible"
       inkscape:isstock="true">
      <path
         inkscape:connector-curvature="0"
         id="path2402-04"
         d="M 0,0 5,-5 -12.5,0 5,5 Z"
         style="fill:#0000cb;fill-opacity:1;fill-rule:evenodd;stroke:#0000cb;stroke-width:1.00000003pt;stroke-opacity:1"
         transform="matrix(-0.8,0,0,-0.8,-10,0)" />
    </marker>
    <marker
       inkscape:stockid="Arrow1Lend"
       orient="auto"
       refY="0"
       refX="0"
       id="marker1577-4"
       style="overflow:visible"
       inkscape:isstock="true">
      <path
         inkscape:connector-curvature="0"
         id="path1317-8"
         d="M 0,0 5,-5 -12.5,0 5,5 Z"
         style="fill:#0000b6;fill-opacity:1;fill-rule:evenodd;stroke:#0000b6;stroke-width:1.00000003pt;stroke-opacity:1"
         transform="matrix(-0.8,0,0,-0.8,-10,0)" />
    </marker>
    <inkscape:path-effect
       effect="spiro"
       id="path-effect1312-5"
       is_visible="true" />
    <marker
       inkscape:stockid="Arrow1Lend"
       orient="auto"
       refY="0"
       refX="0"
       id="marker1577-2"
       style="overflow:visible"
       inkscape:isstock="true">
      <path
         inkscape:connector-curvature="0"
         id="path1317-6"
         d="M 0,0 5,-5 -12.5,0 5,5 Z"
         style="fill:#0000b6;fill-opacity:1;fill-rule:evenodd;stroke:#0000b6;stroke-width:1.00000003pt;stroke-opacity:1"
         transform="matrix(-0.8,0,0,-0.8,-10,0)" />
    </marker>
    <inkscape:path-effect
       effect="spiro"
       id="path-effect1312-0"
       is_visible="true" />
    <marker
       inkscape:stockid="Arrow1Lend"
       orient="auto"
       refY="0"
       refX="0"
       id="marker1577-6"
       style="overflow:visible"
       inkscape:isstock="true">
      <path
         inkscape:connector-curvature="0"
         id="path1317-4"
         d="M 0,0 5,-5 -12.5,0 5,5 Z"
         style="fill:#0000af;fill-opacity:1;fill-rule:evenodd;stroke:#0000b6;stroke-width:1.00000003pt;stroke-opacity:1"
         transform="matrix(-0.8,0,0,-0.8,-10,0)" />
    </marker>
    <inkscape:path-effect
       effect="spiro"
       id="path-effect1312-6"
       is_visible="true" />
  </defs>
  <sodipodi:namedview
     id="base"
     pagecolor="#ffffff"
     bordercolor="#666666"
     borderopacity="1.0"
     inkscape:pageopacity="0.0"
     inkscape:pageshadow="2"
     inkscape:zoom="1.4793416"
     inkscape:cx="55.546673"
     inkscape:cy="70.411425"
     inkscape:document-units="mm"
     inkscape:current-layer="layer1"
     showgrid="false"
     units="in"
     inkscape:window-width="1366"
     inkscape:window-height="721"
     inkscape:window-x="0"
     inkscape:window-y="0"
     inkscape:window-maximized="1" />
  <metadata
     id="metadata5">
    <rdf:RDF>
      <cc:Work
         rdf:about="">
        <dc:format>image/svg+xml</dc:format>
        <dc:type
           rdf:resource="http://purl.org/dc/dcmitype/StillImage" />
        <dc:title />
      </cc:Work>
    </rdf:RDF>
  </metadata>
  <g
     inkscape:label="Layer 1"
     inkscape:groupmode="layer"
     id="layer1"
     transform="translate(0,-246.19998)">
    <rect
       style="fill:none;fill-opacity:1;stroke:#000002;stroke-width:1.17877674;stroke-linecap:round;stroke-linejoin:miter;stroke-miterlimit:4;stroke-dasharray:none;stroke-dashoffset:0;stroke-opacity:1;paint-order:normal"
       id="rect1411"
       width="19.493837"
       height="19.493837"
       x="8.0746822"
       y="269.04587" />
    <rect
       style="fill:none;fill-opacity:1;stroke:#000002;stroke-width:1.17877674;stroke-linecap:round;stroke-linejoin:miter;stroke-miterlimit:4;stroke-dasharray:none;stroke-dashoffset:0;stroke-opacity:1;paint-order:normal"
       id="rect1411-9"
       width="19.493837"
       height="19.493837"
       x="27.568518"
       y="269.04587" />
    <rect
       style="fill:none;fill-opacity:1;stroke:#000002;stroke-width:1.17877674;stroke-linecap:round;stroke-linejoin:miter;stroke-miterlimit:4;stroke-dasharray:none;stroke-dashoffset:0;stroke-opacity:1;paint-order:normal"
       id="rect1411-1"
       width="19.493837"
       height="19.493837"
       x="27.568518"
       y="249.55203" />
    <rect
       style="fill:none;fill-opacity:1;stroke:#000002;stroke-width:1.17877674;stroke-linecap:round;stroke-linejoin:miter;stroke-miterlimit:4;stroke-dasharray:none;stroke-dashoffset:0;stroke-opacity:1;paint-order:normal"
       id="rect1411-0"
       width="19.493837"
       height="19.493837"
       x="8.0746822"
       y="249.55203" />
    <path
       style="fill:none;stroke:#0000b6;stroke-width:0.26499999;stroke-linecap:butt;stroke-linejoin:miter;stroke-miterlimit:4;stroke-dasharray:none;stroke-opacity:1;marker-end:url(#marker1577)"
       d="M -1,296.99998 H 0"
       id="path1310"
       inkscape:connector-curvature="0"
       inkscape:path-effect="#path-effect1312"
       inkscape:original-d="m -1,296.99998 c 3.709978,5.26917 0.452238,-0.12673 1,0"
       sodipodi:nodetypes="cc"
       transform="matrix(-1.1787768,0,0,1.1787768,35.533135,-100.67212)" />
    <path
       style="fill:none;stroke:#0000b6;stroke-width:0.26499999;stroke-linecap:butt;stroke-linejoin:miter;stroke-miterlimit:4;stroke-dasharray:none;stroke-opacity:1;marker-end:url(#marker1577-4)"
       d="M -1,296.99998 H 0"
       id="path1310-8"
       inkscape:connector-curvature="0"
       inkscape:path-effect="#path-effect1312-5"
       inkscape:original-d="m -1,296.99998 c 3.709978,5.26917 0.452238,-0.12673 1,0"
       sodipodi:nodetypes="cc"
       transform="matrix(1.1787768,0,0,1.1787768,39.512136,-81.356091)" />
    <path
       style="fill:none;stroke:#0000b6;stroke-width:0.26499999;stroke-linecap:butt;stroke-linejoin:miter;stroke-miterlimit:4;stroke-dasharray:none;stroke-opacity:1;marker-end:url(#marker1577-2)"
       d="M -1,296.99998 H 0"
       id="path1310-6"
       inkscape:connector-curvature="0"
       inkscape:path-effect="#path-effect1312-0"
       inkscape:original-d="m -1,296.99998 c 3.709978,5.26917 0.452238,-0.12673 1,0"
       sodipodi:nodetypes="cc"
       transform="matrix(0,-1.1787768,1.1787768,0,-302.80449,257.41704)" />
    <path
       style="fill:#0000af;fill-opacity:1;stroke:#0000b6;stroke-width:0.26499999;stroke-linecap:butt;stroke-linejoin:miter;stroke-miterlimit:4;stroke-dasharray:none;stroke-opacity:1;marker-end:url(#marker1577-6)"
       d="M -1,296.99998 H 0"
       id="path1310-2"
       inkscape:connector-curvature="0"
       inkscape:path-effect="#path-effect1312-6"
       inkscape:original-d="m -1,296.99998 c 3.709978,5.26917 0.452238,-0.12673 1,0"
       sodipodi:nodetypes="cc"
       transform="matrix(0,1.1787768,1.1787768,0,-322.50357,261.03665)" />
    <g
       id="g1732"
       ns0:preamble="/home/srl/Talks/2018/SOMME-18-04-2018/preamble.tex"
       ns0:text="$P$"
       transform="matrix(1.4200563,0,0,1.4200563,-285.33998,73.046399)"
       style="fill:#0000cd;fill-opacity:1">
      <defs
         id="defs1725">
        <g
           id="g1723">
          <symbol
             id="textext-9017e729-0"
             overflow="visible"
             style="overflow:visible">
            <path
               id="path1717"
               d=""
               style="stroke:none"
               inkscape:connector-curvature="0" />
          </symbol>
          <symbol
             id="textext-9017e729-1"
             overflow="visible"
             style="overflow:visible">
            <path
               id="path1720"
               d="M 3.015625,-3.15625 H 4.71875 c 1.40625,0 2.796875,-1.03125 2.796875,-2.140625 0,-0.78125 -0.65625,-1.515625 -1.96875,-1.515625 h -3.21875 c -0.1875,0 -0.296875,0 -0.296875,0.1875 0,0.125 0.078125,0.125 0.28125,0.125 0.125,0 0.3125,0.015625 0.421875,0.015625 0.171875,0.03125 0.21875,0.046875 0.21875,0.171875 0,0.03125 0,0.0625 -0.03125,0.1875 l -1.34375,5.34375 c -0.09375,0.390625 -0.109375,0.46875 -0.90625,0.46875 -0.15625,0 -0.265625,0 -0.265625,0.1875 C 0.40625,0 0.515625,0 0.546875,0 0.828125,0 1.53125,-0.03125 1.8125,-0.03125 c 0.21875,0 0.4375,0.015625 0.640625,0.015625 0.21875,0 0.4375,0.015625 0.640625,0.015625 0.078125,0 0.203125,0 0.203125,-0.203125 0,-0.109375 -0.09375,-0.109375 -0.28125,-0.109375 -0.359375,0 -0.640625,0 -0.640625,-0.171875 0,-0.0625 0.015625,-0.109375 0.03125,-0.171875 z M 3.734375,-6.125 C 3.828125,-6.46875 3.84375,-6.5 4.28125,-6.5 h 0.953125 c 0.828125,0 1.359375,0.265625 1.359375,0.953125 0,0.390625 -0.203125,1.25 -0.59375,1.609375 -0.5,0.453125 -1.09375,0.53125 -1.53125,0.53125 H 3.0625 Z m 0,0"
               style="stroke:none"
               inkscape:connector-curvature="0" />
          </symbol>
        </g>
      </defs>
      <g
         id="textext-9017e729-2"
         style="fill:#0000cd;fill-opacity:1">
        <g
           id="g1729"
           style="fill:#0000cd;fill-opacity:1">
          <use
             id="use1727"
             y="134.765"
             x="223.43201"
             xlink:href="#textext-9017e729-1"
             width="100%"
             height="100%"
             style="fill:#0000cd;fill-opacity:1" />
        </g>
      </g>
    </g>
  </g>
</svg>
