{
    "web":{
        "client_id":"198271245790-rne4mde5ivm3hrqkfoqu73f3cjci6voj.apps.googleusercontent.com",
        "project_id":"resume-373211",
        "auth_uri":"https://accounts.google.com/o/oauth2/auth",
        "token_uri":"https://oauth2.googleapis.com/token",
        "auth_provider_x509_cert_url":"https://www.googleapis.com/oauth2/v1/certs",
        "client_secret":"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",
        "javascript_origins":["http://127.0.0.1:5000"]
    }
}