traceID,spanID,process.serviceName,operationName,startTimeMillis,startTime,duration,tags,references,tags.0.type,tags.0.key,tags.0.value,tags.1.type,tags.1.key,tags.1.value,tags.2.type,tags.2.key,tags.2.value,tags.3.type,tags.3.key,tags.3.value,tags.4.type,tags.4.key,tags.4.value,tags.5.type,tags.5.key,tags.5.value,tags.6.type,tags.6.key,tags.6.value,tags.7.type,tags.7.key,tags.7.value,tags.8.type,tags.8.key,tags.8.value,tags.9.type,tags.9.key,tags.9.value,references.0.refType,references.0.spanID,references.0.traceID,tags.10.type,tags.10.key,tags.10.value
d750108274655e35,d750108274655e35,nginx-web-server,/api/user/login,1593446535403,1593446535403000,3778,,,string,sampler.type,const,bool,sampler.param,true,int64,http.status_code,500,string,http.status_line,,bool,error,true,string,component,nginx,string,nginx.worker_pid,21,string,peer.address,172.20.0.1:60362,string,http.method,GET,string,http.url,http://localhost:8080/api/user/login?username=alexx&password=vol397Chasm,,,,string,http.host,localhost:8080
d750108274655e35,c2fedd703a545a15,nginx-web-server,/api/user/login,1593446535404,1593446535404024,2762,,,string,component,nginx,string,nginx.worker_pid,21,string,peer.address,172.20.0.1:60362,string,http.method,GET,string,http.url,http://localhost:8080/api/user/login?username=alexx&password=vol397Chasm,string,http.host,localhost:8080,int64,http.status_code,500,string,http.status_line,,bool,error,true,,,,CHILD_OF,d750108274655e35,d750108274655e35,,,
d750108274655e35,e8ce594a3fe81c9a,user-service,Login,1593446535404,1593446535404586,1897,,,,,,,,,,,,,,,,,,,,,,,,,,,,,,,,,CHILD_OF,f06e000852c56cd,d750108274655e35,,,
d750108274655e35,7403a30f8126a09e,user-service,MmcGetLogin,1593446535404,1593446535404604,242,,,,,,,,,,,,,,,,,,,,,,,,,,,,,,,,,CHILD_OF,e8ce594a3fe81c9a,d750108274655e35,,,
d750108274655e35,42f00b7344f9130d,user-service,MongoFindUser,1593446535404,1593446535404888,1409,,,,,,,,,,,,,,,,,,,,,,,,,,,,,,,,,CHILD_OF,e8ce594a3fe81c9a,d750108274655e35,,,
5e7ebc780e317b4a,5e7ebc780e317b4a,nginx-web-server,/api/user/login,1593446535412,1593446535412000,4096,,,string,sampler.type,const,bool,sampler.param,true,int64,http.status_code,500,string,http.status_line,,bool,error,true,string,component,nginx,string,nginx.worker_pid,21,string,peer.address,172.20.0.1:60368,string,http.method,GET,string,http.url,http://localhost:8080/api/user/login?username=alexx&password=vol397Chasm,,,,string,http.host,localhost:8080
5e7ebc780e317b4a,876567d86767e96,nginx-web-server,/api/user/login,1593446535412,1593446535412706,3390,,,string,component,nginx,string,nginx.worker_pid,21,string,peer.address,172.20.0.1:60368,string,http.method,GET,string,http.url,http://localhost:8080/api/user/login?username=alexx&password=vol397Chasm,string,http.host,localhost:8080,int64,http.status_code,500,string,http.status_line,,bool,error,true,,,,CHILD_OF,5e7ebc780e317b4a,5e7ebc780e317b4a,,,
5e7ebc780e317b4a,eb1c6ba53fc360a9,user-service,Login,1593446535413,1593446535413191,2388,,,,,,,,,,,,,,,,,,,,,,,,,,,,,,,,,CHILD_OF,5c808fcd0a8c746a,5e7ebc780e317b4a,,,
5e7ebc780e317b4a,6a2fa3c3ef3b6afc,user-service,MmcGetLogin,1593446535413,1593446535413212,224,,,,,,,,,,,,,,,,,,,,,,,,,,,,,,,,,CHILD_OF,eb1c6ba53fc360a9,5e7ebc780e317b4a,,,
5e7ebc780e317b4a,898bf0e2fc930b34,user-service,MongoFindUser,1593446535413,1593446535413522,1839,,,,,,,,,,,,,,,,,,,,,,,,,,,,,,,,,CHILD_OF,eb1c6ba53fc360a9,5e7ebc780e317b4a,,,
c7d8042c5be33a78,c7d8042c5be33a78,nginx-web-server,/api/user/login,1593446535420,1593446535420000,4106,,,string,sampler.type,const,bool,sampler.param,true,int64,http.status_code,500,string,http.status_line,,bool,error,true,string,component,nginx,string,nginx.worker_pid,11,string,peer.address,172.20.0.1:60372,string,http.method,GET,string,http.url,http://localhost:8080/api/user/login?username=alexx&password=vol397Chasm,,,,string,http.host,localhost:8080
c7d8042c5be33a78,93861b79086a1008,nginx-web-server,/api/user/login,1593446535420,1593446535420322,3784,,,string,component,nginx,string,nginx.worker_pid,11,string,peer.address,172.20.0.1:60372,string,http.method,GET,string,http.url,http://localhost:8080/api/user/login?username=alexx&password=vol397Chasm,string,http.host,localhost:8080,int64,http.status_code,500,string,http.status_line,,bool,error,true,,,,CHILD_OF,c7d8042c5be33a78,c7d8042c5be33a78,,,
c7d8042c5be33a78,43ae6a13639486ad,user-service,Login,1593446535421,1593446535421237,2179,,,,,,,,,,,,,,,,,,,,,,,,,,,,,,,,,CHILD_OF,13bd82e2d59bcd26,c7d8042c5be33a78,,,
c7d8042c5be33a78,2c214373116a67d8,user-service,MmcGetLogin,1593446535421,1593446535421259,185,,,,,,,,,,,,,,,,,,,,,,,,,,,,,,,,,CHILD_OF,43ae6a13639486ad,c7d8042c5be33a78,,,
c7d8042c5be33a78,a444490aeb651f72,user-service,MongoFindUser,1593446535421,1593446535421503,1689,,,,,,,,,,,,,,,,,,,,,,,,,,,,,,,,,CHILD_OF,43ae6a13639486ad,c7d8042c5be33a78,,,
184878620ce85758,184878620ce85758,nginx-web-server,/api/user/login,1593446535428,1593446535428000,6261,,,string,sampler.type,const,bool,sampler.param,true,int64,http.status_code,500,string,http.status_line,,bool,error,true,string,component,nginx,string,nginx.worker_pid,15,string,peer.address,172.20.0.1:60378,string,http.method,GET,string,http.url,http://localhost:8080/api/user/login?username=alexx&password=vol397Chasm,,,,string,http.host,localhost:8080
184878620ce85758,2c43373f8d9740de,nginx-web-server,/api/user/login,1593446535428,1593446535428763,5499,,,string,component,nginx,string,nginx.worker_pid,15,string,peer.address,172.20.0.1:60378,string,http.method,GET,string,http.url,http://localhost:8080/api/user/login?username=alexx&password=vol397Chasm,string,http.host,localhost:8080,int64,http.status_code,500,string,http.status_line,,bool,error,true,,,,CHILD_OF,184878620ce85758,184878620ce85758,,,
184878620ce85758,c5b4781529307eda,user-service,Login,1593446535429,1593446535429394,3010,,,,,,,,,,,,,,,,,,,,,,,,,,,,,,,,,CHILD_OF,9a65c31f40ac91a,184878620ce85758,,,
184878620ce85758,729f4aff6c18e334,user-service,MmcGetLogin,1593446535429,1593446535429410,135,,,,,,,,,,,,,,,,,,,,,,,,,,,,,,,,,CHILD_OF,c5b4781529307eda,184878620ce85758,,,
184878620ce85758,169fd84722ee6df7,user-service,MongoFindUser,1593446535429,1593446535429608,2249,,,,,,,,,,,,,,,,,,,,,,,,,,,,,,,,,CHILD_OF,c5b4781529307eda,184878620ce85758,,,
8d216e31edad525e,8d216e31edad525e,nginx-web-server,/api/user/login,1593446535439,1593446535439000,4280,,,string,sampler.type,const,bool,sampler.param,true,int64,http.status_code,500,string,http.status_line,,bool,error,true,string,component,nginx,string,nginx.worker_pid,16,string,peer.address,172.20.0.1:60384,string,http.method,GET,string,http.url,http://localhost:8080/api/user/login?username=alexx&password=vol397Chasm,,,,string,http.host,localhost:8080
8d216e31edad525e,5df14d789de09a59,nginx-web-server,/api/user/login,1593446535439,1593446535439970,3309,,,string,component,nginx,string,nginx.worker_pid,16,string,peer.address,172.20.0.1:60384,string,http.method,GET,string,http.url,http://localhost:8080/api/user/login?username=alexx&password=vol397Chasm,string,http.host,localhost:8080,int64,http.status_code,500,string,http.status_line,,bool,error,true,,,,CHILD_OF,8d216e31edad525e,8d216e31edad525e,,,
8d216e31edad525e,35b381cc301f57ab,user-service,Login,1593446535440,1593446535440671,2047,,,,,,,,,,,,,,,,,,,,,,,,,,,,,,,,,CHILD_OF,dad58f7b6929645b,8d216e31edad525e,,,
8d216e31edad525e,6a27ff5c64ba4aed,user-service,MmcGetLogin,1593446535440,1593446535440689,166,,,,,,,,,,,,,,,,,,,,,,,,,,,,,,,,,CHILD_OF,35b381cc301f57ab,8d216e31edad525e,,,
8d216e31edad525e,459b79ef981468f8,user-service,MongoFindUser,1593446535440,1593446535440915,1581,,,,,,,,,,,,,,,,,,,,,,,,,,,,,,,,,CHILD_OF,35b381cc301f57ab,8d216e31edad525e,,,
cde333417b72e111,cde333417b72e111,nginx-web-server,/api/user/login,1593446535447,1593446535447000,5301,,,string,sampler.type,const,bool,sampler.param,true,int64,http.status_code,500,string,http.status_line,,bool,error,true,string,component,nginx,string,nginx.worker_pid,14,string,peer.address,172.20.0.1:60390,string,http.method,GET,string,http.url,http://localhost:8080/api/user/login?username=alexx&password=vol397Chasm,,,,string,http.host,localhost:8080
cde333417b72e111,fed36d6d9b3bbf9d,nginx-web-server,/api/user/login,1593446535448,1593446535448043,4257,,,string,component,nginx,string,nginx.worker_pid,14,string,peer.address,172.20.0.1:60390,string,http.method,GET,string,http.url,http://localhost:8080/api/user/login?username=alexx&password=vol397Chasm,string,http.host,localhost:8080,int64,http.status_code,500,string,http.status_line,,bool,error,true,,,,CHILD_OF,cde333417b72e111,cde333417b72e111,,,
cde333417b72e111,f1dd6ae930601197,user-service,Login,1593446535448,1593446535448784,2794,,,,,,,,,,,,,,,,,,,,,,,,,,,,,,,,,CHILD_OF,271c83688e064325,cde333417b72e111,,,
cde333417b72e111,2f4384d1bb37ce9d,user-service,MmcGetLogin,1593446535448,1593446535448801,188,,,,,,,,,,,,,,,,,,,,,,,,,,,,,,,,,CHILD_OF,f1dd6ae930601197,cde333417b72e111,,,
cde333417b72e111,13133bafbf8df105,user-service,MongoFindUser,1593446535449,1593446535449052,2317,,,,,,,,,,,,,,,,,,,,,,,,,,,,,,,,,CHILD_OF,f1dd6ae930601197,cde333417b72e111,,,
8aaa6134bcbd12de,8aaa6134bcbd12de,nginx-web-server,/api/user/login,1593446535457,1593446535457000,5272,,,string,sampler.type,const,bool,sampler.param,true,int64,http.status_code,500,string,http.status_line,,bool,error,true,string,component,nginx,string,nginx.worker_pid,23,string,peer.address,172.20.0.1:60396,string,http.method,GET,string,http.url,http://localhost:8080/api/user/login?username=alexx&password=vol397Chasm,,,,string,http.host,localhost:8080
8aaa6134bcbd12de,a721f6a6777a9769,nginx-web-server,/api/user/login,1593446535457,1593446535457212,5060,,,string,component,nginx,string,nginx.worker_pid,23,string,peer.address,172.20.0.1:60396,string,http.method,GET,string,http.url,http://localhost:8080/api/user/login?username=alexx&password=vol397Chasm,string,http.host,localhost:8080,int64,http.status_code,500,string,http.status_line,,bool,error,true,,,,CHILD_OF,8aaa6134bcbd12de,8aaa6134bcbd12de,,,
8aaa6134bcbd12de,334d934d46773ad6,user-service,Login,1593446535457,1593446535457869,3537,,,,,,,,,,,,,,,,,,,,,,,,,,,,,,,,,CHILD_OF,58b783521b5aff76,8aaa6134bcbd12de,,,
8aaa6134bcbd12de,3533eb25ec75da04,user-service,MmcGetLogin,1593446535457,1593446535457883,138,,,,,,,,,,,,,,,,,,,,,,,,,,,,,,,,,CHILD_OF,334d934d46773ad6,8aaa6134bcbd12de,,,
8aaa6134bcbd12de,c80c03eb0e5996b,user-service,MongoFindUser,1593446535458,1593446535458073,2817,,,,,,,,,,,,,,,,,,,,,,,,,,,,,,,,,CHILD_OF,334d934d46773ad6,8aaa6134bcbd12de,,,
28b39641e604a205,28b39641e604a205,nginx-web-server,/api/user/login,1593446535467,1593446535467000,4352,,,string,sampler.type,const,bool,sampler.param,true,int64,http.status_code,500,string,http.status_line,,bool,error,true,string,component,nginx,string,nginx.worker_pid,8,string,peer.address,172.20.0.1:60402,string,http.method,GET,string,http.url,http://localhost:8080/api/user/login?username=alexx&password=vol397Chasm,,,,string,http.host,localhost:8080
28b39641e604a205,c6e39d56cd06c5d5,nginx-web-server,/api/user/login,1593446535468,1593446535468047,3306,,,string,component,nginx,string,nginx.worker_pid,8,string,peer.address,172.20.0.1:60402,string,http.method,GET,string,http.url,http://localhost:8080/api/user/login?username=alexx&password=vol397Chasm,string,http.host,localhost:8080,int64,http.status_code,500,string,http.status_line,,bool,error,true,,,,CHILD_OF,28b39641e604a205,28b39641e604a205,,,
28b39641e604a205,897369f2b2822517,user-service,Login,1593446535468,1593446535468704,1925,,,,,,,,,,,,,,,,,,,,,,,,,,,,,,,,,CHILD_OF,26ed67686fe2292a,28b39641e604a205,,,
28b39641e604a205,e6a22af8af49379f,user-service,MmcGetLogin,1593446535468,1593446535468725,175,,,,,,,,,,,,,,,,,,,,,,,,,,,,,,,,,CHILD_OF,897369f2b2822517,28b39641e604a205,,,
28b39641e604a205,e069e56b20e03f24,user-service,MongoFindUser,1593446535468,1593446535468994,1399,,,,,,,,,,,,,,,,,,,,,,,,,,,,,,,,,CHILD_OF,897369f2b2822517,28b39641e604a205,,,
a4715557b724effb,a4715557b724effb,nginx-web-server,/api/user/login,1593446535474,1593446535474000,3640,,,string,sampler.type,const,bool,sampler.param,true,int64,http.status_code,500,string,http.status_line,,bool,error,true,string,component,nginx,string,nginx.worker_pid,9,string,peer.address,172.20.0.1:60408,string,http.method,GET,string,http.url,http://localhost:8080/api/user/login?username=alexx&password=vol397Chasm,,,,string,http.host,localhost:8080
a4715557b724effb,7f49950786690612,nginx-web-server,/api/user/login,1593446535474,1593446535474617,3023,,,string,component,nginx,string,nginx.worker_pid,9,string,peer.address,172.20.0.1:60408,string,http.method,GET,string,http.url,http://localhost:8080/api/user/login?username=alexx&password=vol397Chasm,string,http.host,localhost:8080,int64,http.status_code,500,string,http.status_line,,bool,error,true,,,,CHILD_OF,a4715557b724effb,a4715557b724effb,,,
a4715557b724effb,620e7d13deb89e72,user-service,Login,1593446535475,1593446535475418,1642,,,,,,,,,,,,,,,,,,,,,,,,,,,,,,,,,CHILD_OF,b24082f20fa61722,a4715557b724effb,,,
a4715557b724effb,d4e79320fdbff8ab,user-service,MmcGetLogin,1593446535475,1593446535475431,100,,,,,,,,,,,,,,,,,,,,,,,,,,,,,,,,,CHILD_OF,620e7d13deb89e72,a4715557b724effb,,,
a4715557b724effb,3525708dd068dac8,user-service,MongoFindUser,1593446535475,1593446535475585,1310,,,,,,,,,,,,,,,,,,,,,,,,,,,,,,,,,CHILD_OF,620e7d13deb89e72,a4715557b724effb,,,
ce7e4fcbc28be540,ce7e4fcbc28be540,nginx-web-server,/api/user/login,1593446535480,1593446535480000,3619,,,string,sampler.type,const,bool,sampler.param,true,int64,http.status_code,500,string,http.status_line,,bool,error,true,string,component,nginx,string,nginx.worker_pid,16,string,peer.address,172.20.0.1:60414,string,http.method,GET,string,http.url,http://localhost:8080/api/user/login?username=alexx&password=vol397Chasm,,,,string,http.host,localhost:8080
ce7e4fcbc28be540,9eeae60761f5f9b8,nginx-web-server,/api/user/login,1593446535480,1593446535480742,2876,,,string,component,nginx,string,nginx.worker_pid,16,string,peer.address,172.20.0.1:60414,string,http.method,GET,string,http.url,http://localhost:8080/api/user/login?username=alexx&password=vol397Chasm,string,http.host,localhost:8080,int64,http.status_code,500,string,http.status_line,,bool,error,true,,,,CHILD_OF,ce7e4fcbc28be540,ce7e4fcbc28be540,,,
ce7e4fcbc28be540,7f54774c6bbced97,user-service,Login,1593446535481,1593446535481149,2010,,,,,,,,,,,,,,,,,,,,,,,,,,,,,,,,,CHILD_OF,486a858c9fc3a1ea,ce7e4fcbc28be540,,,
ce7e4fcbc28be540,acb64dd6ff15f931,user-service,MmcGetLogin,1593446535481,1593446535481171,172,,,,,,,,,,,,,,,,,,,,,,,,,,,,,,,,,CHILD_OF,7f54774c6bbced97,ce7e4fcbc28be540,,,
ce7e4fcbc28be540,ba3b713ba694991b,user-service,MongoFindUser,1593446535481,1593446535481431,1478,,,,,,,,,,,,,,,,,,,,,,,,,,,,,,,,,CHILD_OF,7f54774c6bbced97,ce7e4fcbc28be540,,,
40dc26795e76c94a,40dc26795e76c94a,nginx-web-server,/api/user/login,1593446535486,1593446535486000,6234,,,string,sampler.type,const,bool,sampler.param,true,int64,http.status_code,500,string,http.status_line,,bool,error,true,string,component,nginx,string,nginx.worker_pid,22,string,peer.address,172.20.0.1:60418,string,http.method,GET,string,http.url,http://localhost:8080/api/user/login?username=alexx&password=vol397Chasm,,,,string,http.host,localhost:8080
40dc26795e76c94a,116b9c6e08cd265e,nginx-web-server,/api/user/login,1593446535487,1593446535487029,5205,,,string,component,nginx,string,nginx.worker_pid,22,string,peer.address,172.20.0.1:60418,string,http.method,GET,string,http.url,http://localhost:8080/api/user/login?username=alexx&password=vol397Chasm,string,http.host,localhost:8080,int64,http.status_code,500,string,http.status_line,,bool,error,true,,,,CHILD_OF,40dc26795e76c94a,40dc26795e76c94a,,,
40dc26795e76c94a,4554328d6ff7676c,user-service,Login,1593446535487,1593446535487592,3758,,,,,,,,,,,,,,,,,,,,,,,,,,,,,,,,,CHILD_OF,fbe7982be6bef79c,40dc26795e76c94a,,,
40dc26795e76c94a,122e154c0630f50b,user-service,MmcGetLogin,1593446535487,1593446535487606,115,,,,,,,,,,,,,,,,,,,,,,,,,,,,,,,,,CHILD_OF,4554328d6ff7676c,40dc26795e76c94a,,,
40dc26795e76c94a,315d15d1c02cfd87,user-service,MongoFindUser,1593446535487,1593446535487810,2962,,,,,,,,,,,,,,,,,,,,,,,,,,,,,,,,,CHILD_OF,4554328d6ff7676c,40dc26795e76c94a,,,
f7fc4239f08f8c9f,f7fc4239f08f8c9f,nginx-web-server,/api/user/login,1593446535497,1593446535497000,4585,,,string,sampler.type,const,bool,sampler.param,true,int64,http.status_code,500,string,http.status_line,,bool,error,true,string,component,nginx,string,nginx.worker_pid,12,string,peer.address,172.20.0.1:60424,string,http.method,GET,string,http.url,http://localhost:8080/api/user/login?username=alexx&password=vol397Chasm,,,,string,http.host,localhost:8080
f7fc4239f08f8c9f,a94ab39ec6260a09,nginx-web-server,/api/user/login,1593446535497,1593446535497704,3881,,,string,component,nginx,string,nginx.worker_pid,12,string,peer.address,172.20.0.1:60424,string,http.method,GET,string,http.url,http://localhost:8080/api/user/login?username=alexx&password=vol397Chasm,string,http.host,localhost:8080,int64,http.status_code,500,string,http.status_line,,bool,error,true,,,,CHILD_OF,f7fc4239f08f8c9f,f7fc4239f08f8c9f,,,
f7fc4239f08f8c9f,f4372f632b934f44,user-service,Login,1593446535498,1593446535498369,2671,,,,,,,,,,,,,,,,,,,,,,,,,,,,,,,,,CHILD_OF,2afbc8614f120c32,f7fc4239f08f8c9f,,,
f7fc4239f08f8c9f,52b1911d02d601c1,user-service,MmcGetLogin,1593446535498,1593446535498393,228,,,,,,,,,,,,,,,,,,,,,,,,,,,,,,,,,CHILD_OF,f4372f632b934f44,f7fc4239f08f8c9f,,,
f7fc4239f08f8c9f,d2dbc4ca93021808,user-service,MongoFindUser,1593446535498,1593446535498690,2174,,,,,,,,,,,,,,,,,,,,,,,,,,,,,,,,,CHILD_OF,f4372f632b934f44,f7fc4239f08f8c9f,,,
c000b1c2012bcc2d,c000b1c2012bcc2d,nginx-web-server,/api/user/login,1593446535506,1593446535506000,3895,,,string,sampler.type,const,bool,sampler.param,true,int64,http.status_code,500,string,http.status_line,,bool,error,true,string,component,nginx,string,nginx.worker_pid,7,string,peer.address,172.20.0.1:60430,string,http.method,GET,string,http.url,http://localhost:8080/api/user/login?username=alexx&password=vol397Chasm,,,,string,http.host,localhost:8080
c000b1c2012bcc2d,6f5f41471625c759,nginx-web-server,/api/user/login,1593446535506,1593446535506360,3536,,,string,component,nginx,string,nginx.worker_pid,7,string,peer.address,172.20.0.1:60430,string,http.method,GET,string,http.url,http://localhost:8080/api/user/login?username=alexx&password=vol397Chasm,string,http.host,localhost:8080,int64,http.status_code,500,string,http.status_line,,bool,error,true,,,,CHILD_OF,c000b1c2012bcc2d,c000b1c2012bcc2d,,,
c000b1c2012bcc2d,cc190d836abb40ef,user-service,Login,1593446535507,1593446535507118,2115,,,,,,,,,,,,,,,,,,,,,,,,,,,,,,,,,CHILD_OF,4f72fd564c30a5bc,c000b1c2012bcc2d,,,
c000b1c2012bcc2d,4ecdcec4bd0f8277,user-service,MmcGetLogin,1593446535507,1593446535507141,192,,,,,,,,,,,,,,,,,,,,,,,,,,,,,,,,,CHILD_OF,cc190d836abb40ef,c000b1c2012bcc2d,,,
c000b1c2012bcc2d,f4227d16ab835b5a,user-service,MongoFindUser,1593446535507,1593446535507398,1608,,,,,,,,,,,,,,,,,,,,,,,,,,,,,,,,,CHILD_OF,cc190d836abb40ef,c000b1c2012bcc2d,,,
85506788370370c4,85506788370370c4,nginx-web-server,/api/user/login,1593446535515,1593446535515000,4495,,,string,sampler.type,const,bool,sampler.param,true,int64,http.status_code,500,string,http.status_line,,bool,error,true,string,component,nginx,string,nginx.worker_pid,15,string,peer.address,172.20.0.1:60436,string,http.method,GET,string,http.url,http://localhost:8080/api/user/login?username=alexx&password=vol397Chasm,,,,string,http.host,localhost:8080
85506788370370c4,9d1535f7a36abc34,nginx-web-server,/api/user/login,1593446535515,1593446535515439,4056,,,string,component,nginx,string,nginx.worker_pid,15,string,peer.address,172.20.0.1:60436,string,http.method,GET,string,http.url,http://localhost:8080/api/user/login?username=alexx&password=vol397Chasm,string,http.host,localhost:8080,int64,http.status_code,500,string,http.status_line,,bool,error,true,,,,CHILD_OF,85506788370370c4,85506788370370c4,,,
85506788370370c4,a0a97d15912e961b,user-service,Login,1593446535516,1593446535516069,2848,,,,,,,,,,,,,,,,,,,,,,,,,,,,,,,,,CHILD_OF,33c1b48d4ae7c39b,85506788370370c4,,,
85506788370370c4,bfef610a50e00a82,user-service,MmcGetLogin,1593446535516,1593446535516088,211,,,,,,,,,,,,,,,,,,,,,,,,,,,,,,,,,CHILD_OF,a0a97d15912e961b,85506788370370c4,,,
85506788370370c4,2e60405c61de4769,user-service,MongoFindUser,1593446535516,1593446535516353,2332,,,,,,,,,,,,,,,,,,,,,,,,,,,,,,,,,CHILD_OF,a0a97d15912e961b,85506788370370c4,,,
b5fb831b6edfd16d,b5fb831b6edfd16d,nginx-web-server,/api/user/login,1593446535525,1593446535525000,4017,,,string,sampler.type,const,bool,sampler.param,true,int64,http.status_code,500,string,http.status_line,,bool,error,true,string,component,nginx,string,nginx.worker_pid,23,string,peer.address,172.20.0.1:60440,string,http.method,GET,string,http.url,http://localhost:8080/api/user/login?username=alexx&password=vol397Chasm,,,,string,http.host,localhost:8080
b5fb831b6edfd16d,635cde81b965c7ad,nginx-web-server,/api/user/login,1593446535525,1593446535525656,3361,,,string,component,nginx,string,nginx.worker_pid,23,string,peer.address,172.20.0.1:60440,string,http.method,GET,string,http.url,http://localhost:8080/api/user/login?username=alexx&password=vol397Chasm,string,http.host,localhost:8080,int64,http.status_code,500,string,http.status_line,,bool,error,true,,,,CHILD_OF,b5fb831b6edfd16d,b5fb831b6edfd16d,,,
b5fb831b6edfd16d,c13aec36ac5109ef,user-service,Login,1593446535526,1593446535526361,2055,,,,,,,,,,,,,,,,,,,,,,,,,,,,,,,,,CHILD_OF,d585857c7c6f41f1,b5fb831b6edfd16d,,,
b5fb831b6edfd16d,d013a43c681c04b1,user-service,MmcGetLogin,1593446535526,1593446535526382,186,,,,,,,,,,,,,,,,,,,,,,,,,,,,,,,,,CHILD_OF,c13aec36ac5109ef,b5fb831b6edfd16d,,,
b5fb831b6edfd16d,fec51ddf8ce77ef1,user-service,MongoFindUser,1593446535526,1593446535526611,1585,,,,,,,,,,,,,,,,,,,,,,,,,,,,,,,,,CHILD_OF,c13aec36ac5109ef,b5fb831b6edfd16d,,,
fedf42c179cc298d,fedf42c179cc298d,nginx-web-server,/api/user/login,1593446535532,1593446535532000,4309,,,string,sampler.type,const,bool,sampler.param,true,int64,http.status_code,500,string,http.status_line,,bool,error,true,string,component,nginx,string,nginx.worker_pid,19,string,peer.address,172.20.0.1:60444,string,http.method,GET,string,http.url,http://localhost:8080/api/user/login?username=alexx&password=vol397Chasm,,,,string,http.host,localhost:8080
fedf42c179cc298d,c037d3f29e2f7bd9,nginx-web-server,/api/user/login,1593446535533,1593446535533062,3247,,,string,component,nginx,string,nginx.worker_pid,19,string,peer.address,172.20.0.1:60444,string,http.method,GET,string,http.url,http://localhost:8080/api/user/login?username=alexx&password=vol397Chasm,string,http.host,localhost:8080,int64,http.status_code,500,string,http.status_line,,bool,error,true,,,,CHILD_OF,fedf42c179cc298d,fedf42c179cc298d,,,
fedf42c179cc298d,6fea7d1dc73ff778,user-service,Login,1593446535533,1593446535533820,1934,,,,,,,,,,,,,,,,,,,,,,,,,,,,,,,,,CHILD_OF,ac509a3bf4f45672,fedf42c179cc298d,,,
fedf42c179cc298d,9ddebd1e6c540bfd,user-service,MmcGetLogin,1593446535533,1593446535533842,171,,,,,,,,,,,,,,,,,,,,,,,,,,,,,,,,,CHILD_OF,6fea7d1dc73ff778,fedf42c179cc298d,,,
fedf42c179cc298d,f1da6a7dfec93f93,user-service,MongoFindUser,1593446535534,1593446535534092,1403,,,,,,,,,,,,,,,,,,,,,,,,,,,,,,,,,CHILD_OF,6fea7d1dc73ff778,fedf42c179cc298d,,,
5cd30ef9a8438415,5cd30ef9a8438415,nginx-web-server,/api/user/login,1593446535539,1593446535539000,4697,,,string,sampler.type,const,bool,sampler.param,true,int64,http.status_code,500,string,http.status_line,,bool,error,true,string,component,nginx,string,nginx.worker_pid,15,string,peer.address,172.20.0.1:60450,string,http.method,GET,string,http.url,http://localhost:8080/api/user/login?username=alexx&password=vol397Chasm,,,,string,http.host,localhost:8080
5cd30ef9a8438415,3a1b7f16b78ac2ac,nginx-web-server,/api/user/login,1593446535539,1593446535539841,3856,,,string,component,nginx,string,nginx.worker_pid,15,string,peer.address,172.20.0.1:60450,string,http.method,GET,string,http.url,http://localhost:8080/api/user/login?username=alexx&password=vol397Chasm,string,http.host,localhost:8080,int64,http.status_code,500,string,http.status_line,,bool,error,true,,,,CHILD_OF,5cd30ef9a8438415,5cd30ef9a8438415,,,
5cd30ef9a8438415,34600cf507619d88,user-service,Login,1593446535540,1593446535540361,2774,,,,,,,,,,,,,,,,,,,,,,,,,,,,,,,,,CHILD_OF,76f6dc00906a9452,5cd30ef9a8438415,,,
5cd30ef9a8438415,957e12eb2a0e7a43,user-service,MmcGetLogin,1593446535540,1593446535540374,162,,,,,,,,,,,,,,,,,,,,,,,,,,,,,,,,,CHILD_OF,34600cf507619d88,5cd30ef9a8438415,,,
5cd30ef9a8438415,ede675642428cb89,user-service,MongoFindUser,1593446535540,1593446535540604,2375,,,,,,,,,,,,,,,,,,,,,,,,,,,,,,,,,CHILD_OF,34600cf507619d88,5cd30ef9a8438415,,,
362c7c16f927cf4c,362c7c16f927cf4c,nginx-web-server,/api/user/login,1593446535547,1593446535547000,7980,,,string,sampler.type,const,bool,sampler.param,true,int64,http.status_code,500,string,http.status_line,,bool,error,true,string,component,nginx,string,nginx.worker_pid,17,string,peer.address,172.20.0.1:60454,string,http.method,GET,string,http.url,http://localhost:8080/api/user/login?username=alexx&password=vol397Chasm,,,,string,http.host,localhost:8080
362c7c16f927cf4c,8409ffb140705f11,nginx-web-server,/api/user/login,1593446535547,1593446535547853,7127,,,string,component,nginx,string,nginx.worker_pid,17,string,peer.address,172.20.0.1:60454,string,http.method,GET,string,http.url,http://localhost:8080/api/user/login?username=alexx&password=vol397Chasm,string,http.host,localhost:8080,int64,http.status_code,500,string,http.status_line,,bool,error,true,,,,CHILD_OF,362c7c16f927cf4c,362c7c16f927cf4c,,,
362c7c16f927cf4c,a8f9c9082703269f,user-service,Login,1593446535548,1593446535548689,4218,,,,,,,,,,,,,,,,,,,,,,,,,,,,,,,,,CHILD_OF,83b5537d3dee46cc,362c7c16f927cf4c,,,
362c7c16f927cf4c,e27246def47e819,user-service,MmcGetLogin,1593446535548,1593446535548710,179,,,,,,,,,,,,,,,,,,,,,,,,,,,,,,,,,CHILD_OF,a8f9c9082703269f,362c7c16f927cf4c,,,
362c7c16f927cf4c,7d19dceed5d4e050,user-service,MongoFindUser,1593446535549,1593446535549001,3389,,,,,,,,,,,,,,,,,,,,,,,,,,,,,,,,,CHILD_OF,a8f9c9082703269f,362c7c16f927cf4c,,,
5717aa0e74dbfc4b,5717aa0e74dbfc4b,nginx-web-server,/api/user/login,1593446535559,1593446535559000,4698,,,string,sampler.type,const,bool,sampler.param,true,int64,http.status_code,500,string,http.status_line,,bool,error,true,string,component,nginx,string,nginx.worker_pid,21,string,peer.address,172.20.0.1:60460,string,http.method,GET,string,http.url,http://localhost:8080/api/user/login?username=alexx&password=vol397Chasm,,,,string,http.host,localhost:8080
5717aa0e74dbfc4b,a066fb7c4c5e25a4,nginx-web-server,/api/user/login,1593446535560,1593446535560014,3684,,,string,component,nginx,string,nginx.worker_pid,21,string,peer.address,172.20.0.1:60460,string,http.method,GET,string,http.url,http://localhost:8080/api/user/login?username=alexx&password=vol397Chasm,string,http.host,localhost:8080,int64,http.status_code,500,string,http.status_line,,bool,error,true,,,,CHILD_OF,5717aa0e74dbfc4b,5717aa0e74dbfc4b,,,
5717aa0e74dbfc4b,4c356a96e5206d3a,user-service,Login,1593446535560,1593446535560511,2672,,,,,,,,,,,,,,,,,,,,,,,,,,,,,,,,,CHILD_OF,4159059c137959e3,5717aa0e74dbfc4b,,,
5717aa0e74dbfc4b,8191b142d52eeb90,user-service,MmcGetLogin,1593446535560,1593446535560533,173,,,,,,,,,,,,,,,,,,,,,,,,,,,,,,,,,CHILD_OF,4c356a96e5206d3a,5717aa0e74dbfc4b,,,
5717aa0e74dbfc4b,b99f90cc1fdaa0ff,user-service,MongoFindUser,1593446535560,1593446535560779,2176,,,,,,,,,,,,,,,,,,,,,,,,,,,,,,,,,CHILD_OF,4c356a96e5206d3a,5717aa0e74dbfc4b,,,
2b01f0f9fb23d027,2b01f0f9fb23d027,nginx-web-server,/api/user/login,1593446535568,1593446535568000,3412,,,string,sampler.type,const,bool,sampler.param,true,int64,http.status_code,500,string,http.status_line,,bool,error,true,string,component,nginx,string,nginx.worker_pid,23,string,peer.address,172.20.0.1:60464,string,http.method,GET,string,http.url,http://localhost:8080/api/user/login?username=alexx&password=vol397Chasm,,,,string,http.host,localhost:8080
2b01f0f9fb23d027,6ad4bdae2558375e,nginx-web-server,/api/user/login,1593446535568,1593446535568188,3224,,,string,component,nginx,string,nginx.worker_pid,23,string,peer.address,172.20.0.1:60464,string,http.method,GET,string,http.url,http://localhost:8080/api/user/login?username=alexx&password=vol397Chasm,string,http.host,localhost:8080,int64,http.status_code,500,string,http.status_line,,bool,error,true,,,,CHILD_OF,2b01f0f9fb23d027,2b01f0f9fb23d027,,,
2b01f0f9fb23d027,838e2f7fd8347ce9,user-service,Login,1593446535568,1593446535568629,2399,,,,,,,,,,,,,,,,,,,,,,,,,,,,,,,,,CHILD_OF,30a16fed99e93fb3,2b01f0f9fb23d027,,,
2b01f0f9fb23d027,18680847ab0c2d56,user-service,MmcGetLogin,1593446535568,1593446535568652,171,,,,,,,,,,,,,,,,,,,,,,,,,,,,,,,,,CHILD_OF,838e2f7fd8347ce9,2b01f0f9fb23d027,,,
2b01f0f9fb23d027,f6f2c7ce9ec44d28,user-service,MongoFindUser,1593446535568,1593446535568881,1898,,,,,,,,,,,,,,,,,,,,,,,,,,,,,,,,,CHILD_OF,838e2f7fd8347ce9,2b01f0f9fb23d027,,,
