{
  "id": 32338391,
  "node_id": "MDEwOlJlcG9zaXRvcnkzMjMzODM5MQ==",
  "name": "kowa-client",
  "full_name": "aymerick/kowa-client",
  "private": false,
  "owner": {
    "login": "aymerick",
    "id": 34434,
    "node_id": "MDQ6VXNlcjM0NDM0",
    "avatar_url": "https://avatars0.githubusercontent.com/u/34434?v=4",
    "gravatar_id": "",
    "url": "https://api.github.com/users/aymerick",
    "html_url": "https://github.com/aymerick",
    "followers_url": "https://api.github.com/users/aymerick/followers",
    "following_url": "https://api.github.com/users/aymerick/following{/other_user}",
    "gists_url": "https://api.github.com/users/aymerick/gists{/gist_id}",
    "starred_url": "https://api.github.com/users/aymerick/starred{/owner}{/repo}",
    "subscriptions_url": "https://api.github.com/users/aymerick/subscriptions",
    "organizations_url": "https://api.github.com/users/aymerick/orgs",
    "repos_url": "https://api.github.com/users/aymerick/repos",
    "events_url": "https://api.github.com/users/aymerick/events{/privacy}",
    "received_events_url": "https://api.github.com/users/aymerick/received_events",
    "type": "User",
    "site_admin": false
  },
  "html_url": "https://github.com/aymerick/kowa-client",
  "description": "Admin web app for kowa, the static website manager",
  "fork": false,
  "url": "https://api.github.com/repos/aymerick/kowa-client",
  "forks_url": "https://api.github.com/repos/aymerick/kowa-client/forks",
  "keys_url": "https://api.github.com/repos/aymerick/kowa-client/keys{/key_id}",
  "collaborators_url": "https://api.github.com/repos/aymerick/kowa-client/collaborators{/collaborator}",
  "teams_url": "https://api.github.com/repos/aymerick/kowa-client/teams",
  "hooks_url": "https://api.github.com/repos/aymerick/kowa-client/hooks",
  "issue_events_url": "https://api.github.com/repos/aymerick/kowa-client/issues/events{/number}",
  "events_url": "https://api.github.com/repos/aymerick/kowa-client/events",
  "assignees_url": "https://api.github.com/repos/aymerick/kowa-client/assignees{/user}",
  "branches_url": "https://api.github.com/repos/aymerick/kowa-client/branches{/branch}",
  "tags_url": "https://api.github.com/repos/aymerick/kowa-client/tags",
  "blobs_url": "https://api.github.com/repos/aymerick/kowa-client/git/blobs{/sha}",
  "git_tags_url": "https://api.github.com/repos/aymerick/kowa-client/git/tags{/sha}",
  "git_refs_url": "https://api.github.com/repos/aymerick/kowa-client/git/refs{/sha}",
  "trees_url": "https://api.github.com/repos/aymerick/kowa-client/git/trees{/sha}",
  "statuses_url": "https://api.github.com/repos/aymerick/kowa-client/statuses/{sha}",
  "languages_url": "https://api.github.com/repos/aymerick/kowa-client/languages",
  "stargazers_url": "https://api.github.com/repos/aymerick/kowa-client/stargazers",
  "contributors_url": "https://api.github.com/repos/aymerick/kowa-client/contributors",
  "subscribers_url": "https://api.github.com/repos/aymerick/kowa-client/subscribers",
  "subscription_url": "https://api.github.com/repos/aymerick/kowa-client/subscription",
  "commits_url": "https://api.github.com/repos/aymerick/kowa-client/commits{/sha}",
  "git_commits_url": "https://api.github.com/repos/aymerick/kowa-client/git/commits{/sha}",
  "comments_url": "https://api.github.com/repos/aymerick/kowa-client/comments{/number}",
  "issue_comment_url": "https://api.github.com/repos/aymerick/kowa-client/issues/comments{/number}",
  "contents_url": "https://api.github.com/repos/aymerick/kowa-client/contents/{+path}",
  "compare_url": "https://api.github.com/repos/aymerick/kowa-client/compare/{base}...{head}",
  "merges_url": "https://api.github.com/repos/aymerick/kowa-client/merges",
  "archive_url": "https://api.github.com/repos/aymerick/kowa-client/{archive_format}{/ref}",
  "downloads_url": "https://api.github.com/repos/aymerick/kowa-client/downloads",
  "issues_url": "https://api.github.com/repos/aymerick/kowa-client/issues{/number}",
  "pulls_url": "https://api.github.com/repos/aymerick/kowa-client/pulls{/number}",
  "milestones_url": "https://api.github.com/repos/aymerick/kowa-client/milestones{/number}",
  "notifications_url": "https://api.github.com/repos/aymerick/kowa-client/notifications{?since,all,participating}",
  "labels_url": "https://api.github.com/repos/aymerick/kowa-client/labels{/name}",
  "releases_url": "https://api.github.com/repos/aymerick/kowa-client/releases{/id}",
  "deployments_url": "https://api.github.com/repos/aymerick/kowa-client/deployments",
  "created_at": "2015-03-16T16:33:30Z",
  "updated_at": "2015-04-27T14:09:42Z",
  "pushed_at": "2015-10-01T08:17:47Z",
  "git_url": "git://github.com/aymerick/kowa-client.git",
  "ssh_url": "git@github.com:aymerick/kowa-client.git",
  "clone_url": "https://github.com/aymerick/kowa-client.git",
  "svn_url": "https://github.com/aymerick/kowa-client",
  "homepage": "",
  "size": 988,
  "stargazers_count": 0,
  "watchers_count": 0,
  "language": "JavaScript",
  "has_issues": true,
  "has_projects": true,
  "has_downloads": true,
  "has_wiki": false,
  "has_pages": false,
  "forks_count": 0,
  "mirror_url": null,
  "archived": false,
  "disabled": false,
  "open_issues_count": 0,
  "license": {
    "key": "mit",
    "name": "MIT License",
    "spdx_id": "MIT",
    "url": "https://api.github.com/licenses/mit",
    "node_id": "MDc6TGljZW5zZTEz"
  },
  "forks": 0,
  "open_issues": 0,
  "watchers": 0,
  "default_branch": "master",
  "temp_clone_token": null,
  "network_count": 0,
  "subscribers_count": 1
}