{
  "id": 26767408,
  "node_id": "MDEwOlJlcG9zaXRvcnkyNjc2NzQwOA==",
  "name": "dashboard.aptible.com",
  "full_name": "aptible/dashboard.aptible.com",
  "private": false,
  "owner": {
    "login": "aptible",
    "id": 4594193,
    "node_id": "MDEyOk9yZ2FuaXphdGlvbjQ1OTQxOTM=",
    "avatar_url": "https://avatars0.githubusercontent.com/u/4594193?v=4",
    "gravatar_id": "",
    "url": "https://api.github.com/users/aptible",
    "html_url": "https://github.com/aptible",
    "followers_url": "https://api.github.com/users/aptible/followers",
    "following_url": "https://api.github.com/users/aptible/following{/other_user}",
    "gists_url": "https://api.github.com/users/aptible/gists{/gist_id}",
    "starred_url": "https://api.github.com/users/aptible/starred{/owner}{/repo}",
    "subscriptions_url": "https://api.github.com/users/aptible/subscriptions",
    "organizations_url": "https://api.github.com/users/aptible/orgs",
    "repos_url": "https://api.github.com/users/aptible/repos",
    "events_url": "https://api.github.com/users/aptible/events{/privacy}",
    "received_events_url": "https://api.github.com/users/aptible/received_events",
    "type": "Organization",
    "site_admin": false
  },
  "html_url": "https://github.com/aptible/dashboard.aptible.com",
  "description": "DEPRECATED - Ember.js dashboard for the Aptible PaaS",
  "fork": false,
  "url": "https://api.github.com/repos/aptible/dashboard.aptible.com",
  "forks_url": "https://api.github.com/repos/aptible/dashboard.aptible.com/forks",
  "keys_url": "https://api.github.com/repos/aptible/dashboard.aptible.com/keys{/key_id}",
  "collaborators_url": "https://api.github.com/repos/aptible/dashboard.aptible.com/collaborators{/collaborator}",
  "teams_url": "https://api.github.com/repos/aptible/dashboard.aptible.com/teams",
  "hooks_url": "https://api.github.com/repos/aptible/dashboard.aptible.com/hooks",
  "issue_events_url": "https://api.github.com/repos/aptible/dashboard.aptible.com/issues/events{/number}",
  "events_url": "https://api.github.com/repos/aptible/dashboard.aptible.com/events",
  "assignees_url": "https://api.github.com/repos/aptible/dashboard.aptible.com/assignees{/user}",
  "branches_url": "https://api.github.com/repos/aptible/dashboard.aptible.com/branches{/branch}",
  "tags_url": "https://api.github.com/repos/aptible/dashboard.aptible.com/tags",
  "blobs_url": "https://api.github.com/repos/aptible/dashboard.aptible.com/git/blobs{/sha}",
  "git_tags_url": "https://api.github.com/repos/aptible/dashboard.aptible.com/git/tags{/sha}",
  "git_refs_url": "https://api.github.com/repos/aptible/dashboard.aptible.com/git/refs{/sha}",
  "trees_url": "https://api.github.com/repos/aptible/dashboard.aptible.com/git/trees{/sha}",
  "statuses_url": "https://api.github.com/repos/aptible/dashboard.aptible.com/statuses/{sha}",
  "languages_url": "https://api.github.com/repos/aptible/dashboard.aptible.com/languages",
  "stargazers_url": "https://api.github.com/repos/aptible/dashboard.aptible.com/stargazers",
  "contributors_url": "https://api.github.com/repos/aptible/dashboard.aptible.com/contributors",
  "subscribers_url": "https://api.github.com/repos/aptible/dashboard.aptible.com/subscribers",
  "subscription_url": "https://api.github.com/repos/aptible/dashboard.aptible.com/subscription",
  "commits_url": "https://api.github.com/repos/aptible/dashboard.aptible.com/commits{/sha}",
  "git_commits_url": "https://api.github.com/repos/aptible/dashboard.aptible.com/git/commits{/sha}",
  "comments_url": "https://api.github.com/repos/aptible/dashboard.aptible.com/comments{/number}",
  "issue_comment_url": "https://api.github.com/repos/aptible/dashboard.aptible.com/issues/comments{/number}",
  "contents_url": "https://api.github.com/repos/aptible/dashboard.aptible.com/contents/{+path}",
  "compare_url": "https://api.github.com/repos/aptible/dashboard.aptible.com/compare/{base}...{head}",
  "merges_url": "https://api.github.com/repos/aptible/dashboard.aptible.com/merges",
  "archive_url": "https://api.github.com/repos/aptible/dashboard.aptible.com/{archive_format}{/ref}",
  "downloads_url": "https://api.github.com/repos/aptible/dashboard.aptible.com/downloads",
  "issues_url": "https://api.github.com/repos/aptible/dashboard.aptible.com/issues{/number}",
  "pulls_url": "https://api.github.com/repos/aptible/dashboard.aptible.com/pulls{/number}",
  "milestones_url": "https://api.github.com/repos/aptible/dashboard.aptible.com/milestones{/number}",
  "notifications_url": "https://api.github.com/repos/aptible/dashboard.aptible.com/notifications{?since,all,participating}",
  "labels_url": "https://api.github.com/repos/aptible/dashboard.aptible.com/labels{/name}",
  "releases_url": "https://api.github.com/repos/aptible/dashboard.aptible.com/releases{/id}",
  "deployments_url": "https://api.github.com/repos/aptible/dashboard.aptible.com/deployments",
  "created_at": "2014-11-17T17:06:45Z",
  "updated_at": "2020-01-04T15:53:50Z",
  "pushed_at": "2016-11-14T17:00:00Z",
  "git_url": "git://github.com/aptible/dashboard.aptible.com.git",
  "ssh_url": "git@github.com:aptible/dashboard.aptible.com.git",
  "clone_url": "https://github.com/aptible/dashboard.aptible.com.git",
  "svn_url": "https://github.com/aptible/dashboard.aptible.com",
  "homepage": "https://dashboard.aptible.com",
  "size": 4164,
  "stargazers_count": 82,
  "watchers_count": 82,
  "language": "JavaScript",
  "has_issues": true,
  "has_projects": true,
  "has_downloads": true,
  "has_wiki": false,
  "has_pages": false,
  "forks_count": 35,
  "mirror_url": null,
  "archived": true,
  "disabled": false,
  "open_issues_count": 58,
  "license": {
    "key": "mit",
    "name": "MIT License",
    "spdx_id": "MIT",
    "url": "https://api.github.com/licenses/mit",
    "node_id": "MDc6TGljZW5zZTEz"
  },
  "forks": 35,
  "open_issues": 58,
  "watchers": 82,
  "default_branch": "master",
  "temp_clone_token": null,
  "organization": {
    "login": "aptible",
    "id": 4594193,
    "node_id": "MDEyOk9yZ2FuaXphdGlvbjQ1OTQxOTM=",
    "avatar_url": "https://avatars0.githubusercontent.com/u/4594193?v=4",
    "gravatar_id": "",
    "url": "https://api.github.com/users/aptible",
    "html_url": "https://github.com/aptible",
    "followers_url": "https://api.github.com/users/aptible/followers",
    "following_url": "https://api.github.com/users/aptible/following{/other_user}",
    "gists_url": "https://api.github.com/users/aptible/gists{/gist_id}",
    "starred_url": "https://api.github.com/users/aptible/starred{/owner}{/repo}",
    "subscriptions_url": "https://api.github.com/users/aptible/subscriptions",
    "organizations_url": "https://api.github.com/users/aptible/orgs",
    "repos_url": "https://api.github.com/users/aptible/repos",
    "events_url": "https://api.github.com/users/aptible/events{/privacy}",
    "received_events_url": "https://api.github.com/users/aptible/received_events",
    "type": "Organization",
    "site_admin": false
  },
  "network_count": 35,
  "subscribers_count": 12
}