{
  "id": 78260616,
  "node_id": "MDEwOlJlcG9zaXRvcnk3ODI2MDYxNg==",
  "name": "Hamcamp",
  "full_name": "slolobdill44/Hamcamp",
  "private": false,
  "owner": {
    "login": "slolobdill44",
    "id": 14242641,
    "node_id": "MDQ6VXNlcjE0MjQyNjQx",
    "avatar_url": "https://avatars1.githubusercontent.com/u/14242641?v=4",
    "gravatar_id": "",
    "url": "https://api.github.com/users/slolobdill44",
    "html_url": "https://github.com/slolobdill44",
    "followers_url": "https://api.github.com/users/slolobdill44/followers",
    "following_url": "https://api.github.com/users/slolobdill44/following{/other_user}",
    "gists_url": "https://api.github.com/users/slolobdill44/gists{/gist_id}",
    "starred_url": "https://api.github.com/users/slolobdill44/starred{/owner}{/repo}",
    "subscriptions_url": "https://api.github.com/users/slolobdill44/subscriptions",
    "organizations_url": "https://api.github.com/users/slolobdill44/orgs",
    "repos_url": "https://api.github.com/users/slolobdill44/repos",
    "events_url": "https://api.github.com/users/slolobdill44/events{/privacy}",
    "received_events_url": "https://api.github.com/users/slolobdill44/received_events",
    "type": "User",
    "site_admin": false
  },
  "html_url": "https://github.com/slolobdill44/Hamcamp",
  "description": "Full-stack clone of Bandcamp",
  "fork": false,
  "url": "https://api.github.com/repos/slolobdill44/Hamcamp",
  "forks_url": "https://api.github.com/repos/slolobdill44/Hamcamp/forks",
  "keys_url": "https://api.github.com/repos/slolobdill44/Hamcamp/keys{/key_id}",
  "collaborators_url": "https://api.github.com/repos/slolobdill44/Hamcamp/collaborators{/collaborator}",
  "teams_url": "https://api.github.com/repos/slolobdill44/Hamcamp/teams",
  "hooks_url": "https://api.github.com/repos/slolobdill44/Hamcamp/hooks",
  "issue_events_url": "https://api.github.com/repos/slolobdill44/Hamcamp/issues/events{/number}",
  "events_url": "https://api.github.com/repos/slolobdill44/Hamcamp/events",
  "assignees_url": "https://api.github.com/repos/slolobdill44/Hamcamp/assignees{/user}",
  "branches_url": "https://api.github.com/repos/slolobdill44/Hamcamp/branches{/branch}",
  "tags_url": "https://api.github.com/repos/slolobdill44/Hamcamp/tags",
  "blobs_url": "https://api.github.com/repos/slolobdill44/Hamcamp/git/blobs{/sha}",
  "git_tags_url": "https://api.github.com/repos/slolobdill44/Hamcamp/git/tags{/sha}",
  "git_refs_url": "https://api.github.com/repos/slolobdill44/Hamcamp/git/refs{/sha}",
  "trees_url": "https://api.github.com/repos/slolobdill44/Hamcamp/git/trees{/sha}",
  "statuses_url": "https://api.github.com/repos/slolobdill44/Hamcamp/statuses/{sha}",
  "languages_url": "https://api.github.com/repos/slolobdill44/Hamcamp/languages",
  "stargazers_url": "https://api.github.com/repos/slolobdill44/Hamcamp/stargazers",
  "contributors_url": "https://api.github.com/repos/slolobdill44/Hamcamp/contributors",
  "subscribers_url": "https://api.github.com/repos/slolobdill44/Hamcamp/subscribers",
  "subscription_url": "https://api.github.com/repos/slolobdill44/Hamcamp/subscription",
  "commits_url": "https://api.github.com/repos/slolobdill44/Hamcamp/commits{/sha}",
  "git_commits_url": "https://api.github.com/repos/slolobdill44/Hamcamp/git/commits{/sha}",
  "comments_url": "https://api.github.com/repos/slolobdill44/Hamcamp/comments{/number}",
  "issue_comment_url": "https://api.github.com/repos/slolobdill44/Hamcamp/issues/comments{/number}",
  "contents_url": "https://api.github.com/repos/slolobdill44/Hamcamp/contents/{+path}",
  "compare_url": "https://api.github.com/repos/slolobdill44/Hamcamp/compare/{base}...{head}",
  "merges_url": "https://api.github.com/repos/slolobdill44/Hamcamp/merges",
  "archive_url": "https://api.github.com/repos/slolobdill44/Hamcamp/{archive_format}{/ref}",
  "downloads_url": "https://api.github.com/repos/slolobdill44/Hamcamp/downloads",
  "issues_url": "https://api.github.com/repos/slolobdill44/Hamcamp/issues{/number}",
  "pulls_url": "https://api.github.com/repos/slolobdill44/Hamcamp/pulls{/number}",
  "milestones_url": "https://api.github.com/repos/slolobdill44/Hamcamp/milestones{/number}",
  "notifications_url": "https://api.github.com/repos/slolobdill44/Hamcamp/notifications{?since,all,participating}",
  "labels_url": "https://api.github.com/repos/slolobdill44/Hamcamp/labels{/name}",
  "releases_url": "https://api.github.com/repos/slolobdill44/Hamcamp/releases{/id}",
  "deployments_url": "https://api.github.com/repos/slolobdill44/Hamcamp/deployments",
  "created_at": "2017-01-07T05:29:39Z",
  "updated_at": "2019-11-07T15:55:37Z",
  "pushed_at": "2018-07-17T05:11:55Z",
  "git_url": "git://github.com/slolobdill44/Hamcamp.git",
  "ssh_url": "git@github.com:slolobdill44/Hamcamp.git",
  "clone_url": "https://github.com/slolobdill44/Hamcamp.git",
  "svn_url": "https://github.com/slolobdill44/Hamcamp",
  "homepage": "http://www.hamcamp.co",
  "size": 11139,
  "stargazers_count": 2,
  "watchers_count": 2,
  "language": "Ruby",
  "has_issues": true,
  "has_projects": true,
  "has_downloads": true,
  "has_wiki": true,
  "has_pages": false,
  "forks_count": 0,
  "mirror_url": null,
  "archived": false,
  "disabled": false,
  "open_issues_count": 1,
  "license": null,
  "forks": 0,
  "open_issues": 1,
  "watchers": 2,
  "default_branch": "master",
  "temp_clone_token": null,
  "network_count": 0,
  "subscribers_count": 1
}