{
  "id": 147053558,
  "node_id": "MDEwOlJlcG9zaXRvcnkxNDcwNTM1NTg=",
  "name": "RecruitInc",
  "full_name": "ddicorpo/RecruitInc",
  "private": false,
  "owner": {
    "login": "ddicorpo",
    "id": 14812193,
    "node_id": "MDQ6VXNlcjE0ODEyMTkz",
    "avatar_url": "https://avatars3.githubusercontent.com/u/14812193?v=4",
    "gravatar_id": "",
    "url": "https://api.github.com/users/ddicorpo",
    "html_url": "https://github.com/ddicorpo",
    "followers_url": "https://api.github.com/users/ddicorpo/followers",
    "following_url": "https://api.github.com/users/ddicorpo/following{/other_user}",
    "gists_url": "https://api.github.com/users/ddicorpo/gists{/gist_id}",
    "starred_url": "https://api.github.com/users/ddicorpo/starred{/owner}{/repo}",
    "subscriptions_url": "https://api.github.com/users/ddicorpo/subscriptions",
    "organizations_url": "https://api.github.com/users/ddicorpo/orgs",
    "repos_url": "https://api.github.com/users/ddicorpo/repos",
    "events_url": "https://api.github.com/users/ddicorpo/events{/privacy}",
    "received_events_url": "https://api.github.com/users/ddicorpo/received_events",
    "type": "User",
    "site_admin": false
  },
  "html_url": "https://github.com/ddicorpo/RecruitInc",
  "description": "2018 - 2019 Capstone Project for Team RecruitInc",
  "fork": false,
  "url": "https://api.github.com/repos/ddicorpo/RecruitInc",
  "forks_url": "https://api.github.com/repos/ddicorpo/RecruitInc/forks",
  "keys_url": "https://api.github.com/repos/ddicorpo/RecruitInc/keys{/key_id}",
  "collaborators_url": "https://api.github.com/repos/ddicorpo/RecruitInc/collaborators{/collaborator}",
  "teams_url": "https://api.github.com/repos/ddicorpo/RecruitInc/teams",
  "hooks_url": "https://api.github.com/repos/ddicorpo/RecruitInc/hooks",
  "issue_events_url": "https://api.github.com/repos/ddicorpo/RecruitInc/issues/events{/number}",
  "events_url": "https://api.github.com/repos/ddicorpo/RecruitInc/events",
  "assignees_url": "https://api.github.com/repos/ddicorpo/RecruitInc/assignees{/user}",
  "branches_url": "https://api.github.com/repos/ddicorpo/RecruitInc/branches{/branch}",
  "tags_url": "https://api.github.com/repos/ddicorpo/RecruitInc/tags",
  "blobs_url": "https://api.github.com/repos/ddicorpo/RecruitInc/git/blobs{/sha}",
  "git_tags_url": "https://api.github.com/repos/ddicorpo/RecruitInc/git/tags{/sha}",
  "git_refs_url": "https://api.github.com/repos/ddicorpo/RecruitInc/git/refs{/sha}",
  "trees_url": "https://api.github.com/repos/ddicorpo/RecruitInc/git/trees{/sha}",
  "statuses_url": "https://api.github.com/repos/ddicorpo/RecruitInc/statuses/{sha}",
  "languages_url": "https://api.github.com/repos/ddicorpo/RecruitInc/languages",
  "stargazers_url": "https://api.github.com/repos/ddicorpo/RecruitInc/stargazers",
  "contributors_url": "https://api.github.com/repos/ddicorpo/RecruitInc/contributors",
  "subscribers_url": "https://api.github.com/repos/ddicorpo/RecruitInc/subscribers",
  "subscription_url": "https://api.github.com/repos/ddicorpo/RecruitInc/subscription",
  "commits_url": "https://api.github.com/repos/ddicorpo/RecruitInc/commits{/sha}",
  "git_commits_url": "https://api.github.com/repos/ddicorpo/RecruitInc/git/commits{/sha}",
  "comments_url": "https://api.github.com/repos/ddicorpo/RecruitInc/comments{/number}",
  "issue_comment_url": "https://api.github.com/repos/ddicorpo/RecruitInc/issues/comments{/number}",
  "contents_url": "https://api.github.com/repos/ddicorpo/RecruitInc/contents/{+path}",
  "compare_url": "https://api.github.com/repos/ddicorpo/RecruitInc/compare/{base}...{head}",
  "merges_url": "https://api.github.com/repos/ddicorpo/RecruitInc/merges",
  "archive_url": "https://api.github.com/repos/ddicorpo/RecruitInc/{archive_format}{/ref}",
  "downloads_url": "https://api.github.com/repos/ddicorpo/RecruitInc/downloads",
  "issues_url": "https://api.github.com/repos/ddicorpo/RecruitInc/issues{/number}",
  "pulls_url": "https://api.github.com/repos/ddicorpo/RecruitInc/pulls{/number}",
  "milestones_url": "https://api.github.com/repos/ddicorpo/RecruitInc/milestones{/number}",
  "notifications_url": "https://api.github.com/repos/ddicorpo/RecruitInc/notifications{?since,all,participating}",
  "labels_url": "https://api.github.com/repos/ddicorpo/RecruitInc/labels{/name}",
  "releases_url": "https://api.github.com/repos/ddicorpo/RecruitInc/releases{/id}",
  "deployments_url": "https://api.github.com/repos/ddicorpo/RecruitInc/deployments",
  "created_at": "2018-09-02T04:14:46Z",
  "updated_at": "2019-05-14T15:03:37Z",
  "pushed_at": "2019-04-22T03:26:49Z",
  "git_url": "git://github.com/ddicorpo/RecruitInc.git",
  "ssh_url": "git@github.com:ddicorpo/RecruitInc.git",
  "clone_url": "https://github.com/ddicorpo/RecruitInc.git",
  "svn_url": "https://github.com/ddicorpo/RecruitInc",
  "homepage": "",
  "size": 5405,
  "stargazers_count": 1,
  "watchers_count": 1,
  "language": "TypeScript",
  "has_issues": true,
  "has_projects": true,
  "has_downloads": true,
  "has_wiki": true,
  "has_pages": false,
  "forks_count": 0,
  "mirror_url": null,
  "archived": false,
  "disabled": false,
  "open_issues_count": 30,
  "license": {
    "key": "other",
    "name": "Other",
    "spdx_id": "NOASSERTION",
    "url": null,
    "node_id": "MDc6TGljZW5zZTA="
  },
  "forks": 0,
  "open_issues": 30,
  "watchers": 1,
  "default_branch": "master",
  "temp_clone_token": null,
  "network_count": 0,
  "subscribers_count": 6
}