<?xml version="1.0" encoding="UTF-8"?>
<!DOCTYPE svg PUBLIC "-//W3C//DTD SVG 1.1//EN" "http://www.w3.org/Graphics/SVG/1.1/DTD/svg11.dtd">
<!-- Creator: CorelDRAW 2018 (64-Bit) -->
<svg xmlns="http://www.w3.org/2000/svg" xml:space="preserve" width="210mm" height="297mm" version="1.1" style="shape-rendering:geometricPrecision; text-rendering:geometricPrecision; image-rendering:optimizeQuality; fill-rule:evenodd; clip-rule:evenodd"
viewBox="0 0 21000 29700"
 xmlns:xlink="http://www.w3.org/1999/xlink">
 <defs>
  <style type="text/css">
   <![CDATA[
    .str3 {stroke:#6A6A6A;stroke-width:150;stroke-miterlimit:22.9256}
    .str1 {stroke:#D2D2D2;stroke-width:2;stroke-miterlimit:22.9256}
    .str0 {stroke:#6A6A6A;stroke-width:20;stroke-miterlimit:22.9256}
    .str5 {stroke:#6A6A6A;stroke-width:5;stroke-linejoin:round;stroke-miterlimit:22.9256}
    .str4 {stroke:#6A6A6A;stroke-width:150;stroke-linecap:round;stroke-miterlimit:22.9256}
    .str2 {stroke:#D2D2D2;stroke-width:2;stroke-linecap:round;stroke-miterlimit:22.9256}
    .fil1 {fill:none}
    .fil4 {fill:#727271}
    .fil0 {fill:#6A6A6A}
    .fil2 {fill:#6A6A6A}
    .fil3 {fill:white}
   ]]>
  </style>
 </defs>
 <g id="Слой_x0020_1">
  <metadata id="CorelCorpID_0Corel-Layer"/>
  <polygon class="fil0 str0" points="2434.31,1860.78 1481.82,2410.7 529.32,2960.63 529.32,1860.78 529.32,760.93 1481.82,1310.86 "/>
  <g id="_2152237496992">
   <g id="_1950893345072">
    <rect class="fil0 str0" transform="matrix(2.64845E-14 -1 1 2.64845E-14 18481.3 1971.02)" width="220.48" height="1984.38"/>
    <rect class="fil0 str0" x="19363.25" y="868.59" width="220.48" height="1984.38"/>
   </g>
  </g>
  <polygon class="fil0 str0" points="7649.08,1664.43 7827.26,1561.56 8345.53,1262.35 8345.53,1860.78 8345.53,2459.21 7827.26,2160 7649.08,2057.13 7649.08,2459.21 7130.81,2160 6612.55,1860.78 7130.81,1561.56 7649.08,1262.35 "/>
  <g id="_2152237495200">
   <g id="_2523796940688">
    <path class="fil0 str0" d="M13116.63 915.6c-6.92,19.14 -222.02,231.03 -256.26,264.75l-198.68 189.74c-12.14,11.89 -18.49,17.94 -30.82,29.9 -6.22,6.05 -9.74,9.99 -15.75,14.96 -18.7,15.47 -2.73,4.38 -20.26,14.08 -12.78,24.25 -62.84,13.27 -124.69,13.81 -306.45,2.65 -252.58,-27.46 -342.64,74.16l0 679.67c27.99,37.19 5.09,33.32 53.36,62.73l25.71 17.64c71.42,-12.08 219.42,-1.72 301.66,-2.09 83.93,-0.37 73.11,-10.98 117.86,34.37l381.19 372.79c61.61,57.31 251.8,264.52 306.81,294.92 208.11,114.95 163.84,-262.8 163.84,-397.48 0,-403.56 0,-807.11 0,-1210.67 0,-96.75 12.12,-537.01 -13.97,-590.65 -14.83,-30.49 -50.64,-57.24 -94.06,-55.04 -100.12,5.08 -196.77,181.44 -253.3,192.41z"/>
    <path class="fil0 str0" d="M14071.64 849.58l-4 4c-14.67,44.05 -24.91,39.8 -21.95,104.09 42.25,86.23 123.58,80.12 147.78,122.63 47.1,14.63 155.01,110.66 181.17,142.84 37.34,45.95 105.71,124.17 129.5,191.39 25.22,11.21 78.95,177.14 89.12,222.16 23.07,102.13 27.69,177.68 24.14,288.03 -0.5,12.89 0.06,9.59 -3.09,21.68 -0.39,1.5 -2.64,6.77 -2.98,5.72 -0.34,-1.04 -2.44,3.46 -3.61,5.22 11,56.34 -16.66,124.03 -28.39,172.96 -19.43,78.6 -60.81,145.65 -89.87,213.17 -10.06,6.04 -52.67,71.84 -65.6,88.11 -39.06,49.15 -100.27,113.48 -150.9,153.77 -18.96,15.08 -72.16,51.31 -82,64.23 -32.51,12.66 -72.21,33.66 -103.45,54.69 -34.1,22.96 -52.57,51.35 -49.18,111.28 86.71,169.8 194.02,18.43 261.62,11.45 9.78,-19.6 81.71,-67.83 101.15,-83.09 169.07,-132.7 225.68,-258.31 257.24,-279.79 1.94,-15.87 -1.45,-3.99 6.03,-20.89 0.15,-0.35 7.79,-13.65 8.03,-14.06 55.21,-93.02 92.28,-210.15 104.74,-230.38 42.95,-203.47 60.41,-280.22 38.23,-502.49 -25.03,-205.25 -126.52,-410.28 -226.6,-534.87 -207.02,-257.68 -367.42,-293.84 -413.04,-333.54 -49.89,-2.44 -71.09,8.45 -104.09,21.69z"/>
    <path class="fil0 str0" d="M14166.09 1662.91c5.38,6.04 5.44,4.73 11.02,15.39 4.82,9.21 3.57,6.15 6.88,17.85 4.29,15.21 4.39,23.67 6.63,38.18 26.46,78.46 6.92,339.11 -44.77,380.78 -15.13,64.57 -83.12,146.03 -122.02,183.02 -59.29,56.39 -89.01,84.55 -175.44,122.06 -2.29,15.76 -6.65,16.53 -24.06,29.95 -9.6,32.44 -11.22,52.38 -6.28,91.3 26.82,28.32 20.94,35.52 56.09,58.83l80.78 2.89c11.33,-11.32 92.07,-56.34 116.62,-74.47 185.5,-137.07 238.52,-290.07 263.59,-314.67l38.59 -106.56c26.53,-92.71 45.14,-189.63 37.51,-296.93 -3.34,-46.99 -11.01,-99.88 -21.79,-144.67 -8.71,-36.22 -36.22,-100.7 -36.48,-127.3 -6.53,-7.93 -2.16,-1.26 -10.85,-15.57l-45.85 -93.15 -2.49 -9.19c-19.74,-12.93 -9.74,-4.99 -24.02,-24.17 -7.59,-10.21 -10.09,-14.62 -15.79,-22.05 -17.09,-22.28 -19.79,-27.36 -33.05,-51.19 -14.59,-2.34 -12.66,-4.07 -24.88,-19.83 -13.28,-17.11 -10.02,-10.59 -15.51,-26.66l-89.72 -78.25c-14.1,-3.85 2.92,8.11 -23.09,-10.94 -18.05,-13.23 -9.95,-6.63 -16.24,-18.18 -24.28,-5.5 -69.21,-35.01 -96.52,-49.91 -129.28,-42.69 -193.86,128.96 -82.89,187.84 127.34,67.56 303.09,257.99 294.03,355.6z"/>
    <path class="fil0 str0" d="M13551.01 1528.82c-1.16,53.89 -0.18,64.07 28.27,98.32 28.63,25.48 57,26.72 71.14,38.54 46.78,13.1 64.21,31.64 91.88,60.43 25.41,26.42 38.57,63.27 44.12,107.21 8.39,103.52 -39.15,165.29 -99.19,204.15 -42.91,27.77 -61.95,13.31 -101.35,51.08 -47.95,45.96 -23.4,70.29 -22.12,125.07 8.58,6.5 15.02,11.25 27.38,21.63l29.23 27.36c23.63,-1.59 92.02,-8.85 103.99,-8.41l41.36 -24.27c61.28,-30.56 123.14,-87.1 160.39,-143.77l46.14 -73c0.29,-44.78 42.76,-122.73 14.78,-242.21 -58.71,-250.78 -352.65,-420.94 -436.02,-242.13z"/>
   </g>
  </g>
  <g id="_2152237495872">
   <circle class="fil1 str1" cx="9938.63" cy="35470.84" r="15"/>
   <line class="fil1 str2" x1="9938.63" y1="35470.84" x2="9938.63" y2= "35461.84" />
   <line class="fil1 str2" x1="9938.63" y1="35470.84" x2="9928.63" y2= "35470.84" />
  </g>
  <g id="_2152237493568">
   <rect class="fil0 str0" x="3794.51" y="749.75" width="458.34" height="2222.06"/>
   <rect class="fil0 str0" x="4824.51" y="749.75" width="458.34" height="2222.06"/>
  </g>
  <g id="_2152237494592">
   <circle class="fil1 str3" cx="16474.88" cy="1860.78" r="810.07"/>
   <line class="fil1 str4" x1="16474.88" y1="1860.78" x2="16474.88" y2= "1374.74" />
   <line class="fil1 str4" x1="16474.88" y1="1860.78" x2="15934.83" y2= "1860.78" />
  </g>
  <path class="fil2" d="M1211.63 4306.7l0 157.2c-92.49,2.06 -173.42,71.6 -245.63,88.43 -37.61,-25.19 -88.81,-84.08 -127.72,-117.9 -128.9,68.2 -305.15,244.45 -373.35,373.35 33.82,38.91 92.71,90.11 117.9,127.72l-98.25 245.63c-199.97,0 -206.33,-62.17 -206.33,334.05 0,41.02 10.53,158.31 23.72,182.6 21.4,39.4 97.23,23.72 182.61,23.72l98.25 245.63c-25.19,37.61 -84.08,88.81 -117.9,127.72 68.2,128.9 244.45,305.15 373.35,373.35 38.91,-33.82 90.11,-92.71 127.72,-117.9 72.21,16.83 153.14,86.37 245.63,88.43 0,211.7 -60.76,216.15 334.05,216.15 254.71,0 206.32,-40.17 206.32,-216.15 92.49,-2.06 173.42,-71.6 245.63,-88.43 37.61,25.19 88.81,84.08 127.72,117.9 128.9,-68.2 305.15,-244.45 373.35,-373.35 -33.82,-38.91 -92.71,-90.11 -117.9,-127.72l98.25 -245.63c199.97,0 206.33,62.17 206.33,-334.05 0,-254.29 -36.82,-206.32 -206.33,-206.32l-98.25 -245.63c25.19,-37.61 84.08,-88.81 117.9,-127.72 -68.2,-128.9 -244.45,-305.15 -373.35,-373.35 -38.91,33.82 -90.11,92.71 -127.72,117.9 -72.21,-16.83 -153.14,-86.37 -245.63,-88.43 0,-211.7 60.76,-216.15 -334.05,-216.15 -47.71,0 -206.32,1.66 -206.32,58.95zm169.6 537.8c-307.3,54.89 -570.17,334.29 -506.11,713.5 50.49,298.92 345.73,565.98 713.55,500.05 301.39,-54.02 562.82,-340.97 499.81,-713.39 -50.29,-297.28 -344.37,-564.99 -707.25,-500.16z"/>
  <g id="_2152237488992">
   <rect class="fil0 str5" x="9752.87" y="411.22" width="1449.56" height="2899.11" rx="241.59" ry="241.59"/>
   <rect class="fil3" x="9825.35" y="652.81" width="1304.6" height="241.59"/>
   <rect class="fil3" x="9825.35" y="1136" width="1304.6" height="241.59" rx="241.59" ry="241.59"/>
   <rect class="fil3" x="9825.35" y="2827.14" width="1304.6" height="241.59"/>
   <circle class="fil3" cx="10617.65" cy="1619.18" r="120.8"/>
   <circle class="fil3" cx="10960.83" cy="1619.18" r="120.8"/>
  </g>
  <path class="fil4" d="M4894.19 4728.42l-818.34 471.43c-44.06,-41.03 -87.69,-74.21 -161.84,-88.49 -403.3,-77.7 -576.63,471.24 -227.86,648.11 129.68,65.77 276.54,43.45 387.42,-55.06l618.79 356.38c59.61,34.05 153.02,97.04 209.97,118.04 -52.77,632.71 776.76,468.25 657.85,1.87 -38.42,-150.67 -171.62,-261.7 -337.2,-257.49 -127.76,3.25 -166.26,62.13 -221.98,84.49l-817.16 -474.94 3.53 -162.75c42.54,-35.97 96.66,-59.62 145.3,-88.87 54.76,-32.94 96.32,-55.6 147.93,-86.36l444.2 -259.09c88.02,-54.36 57.54,-42.62 134.57,5.36 107.95,67.24 275.04,57.22 371.88,-16.62 222.24,-169.48 184.37,-485.91 -53.61,-597.52 -128.29,-60.16 -278.93,-28.4 -363.81,44.91 -100.15,86.5 -136.01,190.29 -119.64,356.6z"/>
  <path class="fil2" d="M6949.5 4303.15c-7.88,13.8 -28.71,21.33 -41.51,30.36 -78.2,55.21 -156.7,129.58 -209.37,210.36 -8.24,12.63 -16.2,31.87 -29.05,39.2 -1.51,12.51 -17.99,37.31 -26.11,53.89 -6.34,12.96 -18.61,43.6 -25.45,52.76 -3.74,17.48 -28.64,78.96 -39.48,125.68 -52.17,224.79 -16.74,470.14 79.39,675.18 48.38,103.21 60.97,117.11 114.2,209.48 11.4,14.94 20.81,30.9 31.61,46.98 10.77,16.03 24.81,33.17 32.75,51.13 7.25,4.54 59.92,76.05 70.26,89.45 67.13,86.89 154.38,178.51 229.69,253.88 53.58,53.61 107.93,103.38 166.47,154.84l173.33 144.61c19.31,8.38 59.2,42.32 80.07,57.24 16.49,11.79 66.86,43.47 74.53,57.22 9.64,1.63 3.8,-0.76 14.24,5.81 25.47,16.02 178.95,123.13 194.76,123.05 8.12,-0.04 38.51,-25.53 58.01,-30.02 9.41,-13.42 63.75,-43.21 80.28,-54.36 22.11,-14.9 57.58,-42.37 80.56,-52.54 7.62,-11.72 39.37,-30.23 52.55,-40.02 19.69,-14.63 34.4,-24.7 52.96,-38.92 35.76,-27.4 69.57,-56.28 105.58,-81.67l193.78 -169.68c13.54,-12.32 16.59,-13.4 30.64,-29.27 9.24,-10.43 20.33,-18.39 31.02,-29.02 53.9,-53.6 126.95,-127.21 176.65,-186.87 15.63,-18.78 39.26,-49.83 55.82,-64.28 10.09,-16.8 28.42,-37.12 41.31,-53.99 14.59,-19.09 26.98,-35.16 41.08,-54.13 11.9,-16.01 69.78,-106.29 77.24,-110.77 6.56,-17.35 18.61,-34.35 28.68,-51.61 8.47,-14.52 17.94,-32.83 27.02,-47.22 9.49,-15.09 18.58,-34.12 27.96,-52.96 8.48,-17.05 15.65,-39.07 25.37,-52.96 5.09,-17.99 13.88,-36.55 21.34,-55.6 5.82,-14.85 11.9,-43.26 22.42,-52.29 -0.42,-14.8 7.91,-35.83 12.36,-50.95 6.85,-33.96 17.24,-69.43 24.95,-105.46 8.45,-39.51 10.14,-79.63 14.12,-99.13l2.89 -9.19c0.18,-1.59 0.73,-1.95 1.27,-2.83l-0.86 -48.16 0.53 -56.47c-4.18,-76.54 -9.61,-129.35 -27.29,-199.24 -8.29,-32.82 -16.03,-58.85 -27.59,-88.93 -7.12,-18.52 -30.54,-67.04 -32.15,-80.51 -10.59,-8.33 -25.51,-38.95 -29.24,-51.41 -4.84,-3.59 -45.74,-66.35 -54.28,-77.28 -21.56,-27.61 -39.7,-46.77 -62.58,-71.3 -20.37,-21.83 -45.21,-44.71 -70.06,-64.16l-75.1 -56.34c-23.12,-6.98 -94,-57.71 -191.16,-86.71 -16.93,-5.05 -62.96,-13.69 -71.32,-19.29l-58.75 -2.67 -42.38 -0.36c-64.4,3.12 -126.04,14 -179.46,33.09 -25.05,8.95 -50.45,19.26 -74.55,31.41 -21.68,10.92 -48.91,28.86 -66.23,35.45 -16.76,13.65 -43.66,29.59 -62.52,43.64 -20.69,15.42 -39.36,29.91 -57.02,45.37l-103.85 101.37c-2.67,-1.95 -4.04,-2.19 -7.76,-6.74 -6.97,-8.51 -2.51,-2.08 -4.44,-8.59 -12.18,-7.02 -70.59,-68.63 -101.7,-93.58 -11.35,-9.1 -24.39,-19.63 -34.01,-29.61 -24.46,-13 -51.93,-36.56 -80.16,-53.8 -14.27,-8.71 -75.34,-38.6 -82.61,-45.06 -15.07,-3.19 -32.26,-11.78 -45.83,-17.01 -35.74,-13.75 -79.64,-24.04 -118.45,-29.86l-21.2 -5.23c-0.55,-1.26 -1.98,-0.78 -2.87,-1.35 -42.88,9.77 -87.16,-14.13 -222.7,24.07 -68.2,19.22 -154.97,72.23 -168.6,73.88z"/>
  <g id="_2152237488288">
   <path class="fil2" d="M11778.73 4680.12c-13.85,12.56 0.49,4.01 -24.82,14.66 -8.28,3.48 -19.28,6.57 -27.79,9.89 -22.96,8.97 -36.34,15.43 -59.55,21.72l-177.43 118.38c-113.37,89.94 -139.92,128.13 -230.58,222.2 -74.76,77.57 -270.56,329.78 -349.39,404.95 -57.33,54.66 -93.4,102.88 -150.68,150.73 -15.93,13.32 -25.22,21.92 -39.07,36.25 -20.02,20.71 -22.67,19 -41.01,34.59l-82.37 68.27c-26.13,19.48 -154.17,109.44 -186.75,110.66l-205.75 85.39c-24.5,16.4 -112.38,35.02 -139.51,28.48 -8.35,4.98 -2.02,2.98 -19.32,8.17 -7.32,2.2 -11.98,3.11 -19.41,4.41 -19.26,3.38 -32.95,3.59 -54.03,7.75l-122.21 3.16 0 226.87 45.25 -0.75c55.37,-1.05 103.57,-5.74 158.28,-12.79 49.41,-6.37 108.75,-23.55 153.52,-26.43l95.43 -30.23c49.26,-14.71 196.96,-83.37 219.63,-85.17 20.17,-23.26 89.27,-58.79 119.7,-70.72l166.58 -127.55c124.44,-95.1 157.49,-152.99 233.36,-219.44l143.47 -158.16c22.73,-26.02 48.82,-64.06 73.03,-85.62 6.67,-11.3 -0.46,-2.53 12.52,-17.06 6.22,-6.98 12.68,-12.67 18.75,-18.52 13.13,-24.07 14.45,-16.7 31.09,-37.67 16.49,-20.79 9.14,-26.96 30.28,-29.98 23.34,-37.55 40.15,-65.48 79.84,-87.89 7.02,-21.45 -0.53,-10.89 17.22,-26.08l36.14 -38.46c10.58,-18.46 18.87,-25.63 35.09,-41.17l37.6 -27.46c0.6,-1.96 3.01,-1.36 4.6,-1.83 23.23,-33.74 55,-57.22 90.97,-77.82 14.83,-34.47 173.17,-109.52 233.23,-121.57l-0.14 422.32 2.38 13.44 4.39 -1.65 106.57 -84.21c38.11,-46.1 93.26,-85.62 142.86,-124.62 15.96,-12.54 20.55,-20.42 35.52,-32.24l317.57 -263.23c57.52,-43.34 67.85,-43.58 65.96,-70.48 -25.6,-5.89 -93.12,-68.07 -119.56,-90.21l-283.17 -237c-21.29,-17.79 -39.08,-22.21 -47.7,-47.82 -33.98,-12.24 -41.45,-22.49 -66.24,-53.22 -10.19,-2.35 -7.97,-2.04 -17.99,-8.68 -0.09,-0.07 -16.56,-13.43 -16.58,-13.45 -15.8,-12.84 -21.45,-10.49 -25.27,-27.5 -17.45,-10.78 -31.93,-17.68 -45.66,-29.88 -14.34,-12.73 -18.03,-19.15 -29.98,-29.41l-20.86 -14.46 -3.86 459.39 -104.15 18.75z"/>
   <path class="fil2" d="M11855.03 5987.28l-82.92 -28.81c-94.65,-43.85 -174.21,-112.68 -233.74,-166.99 -53.09,-48.44 -122.03,-131.46 -143.05,-150.79 -21.17,-19.46 -30.27,-30.52 -41.85,-56.28 -16.77,3.27 -19,2.26 -27.42,5.98 -15.36,35.23 -40.63,52.47 -64,83.45 -21.46,28.46 -46.52,45.41 -63.1,80.16 28.28,23.24 30.46,40.69 60.56,67.62 24.52,21.92 47.95,41.79 60.64,71.43l3.71 3.72c23.07,15.29 35.06,32.13 58.46,51 19.51,15.72 36.19,23.05 47.54,52.94l5.04 3.6 233.8 159.17c29,1.08 68.82,26.43 102.05,37.51 29.18,9.73 80.06,23.09 113.83,26.61l-0.08 446.45 2.38 13.44 4.39 -1.65c8.4,-10.66 85.86,-79.22 106.57,-84.21 1.29,-1.56 3.08,-3.58 3.97,-4.62l30.15 -32.54c15.48,-13.29 18.87,-13.52 37.52,-30.34 20.09,-18.11 47.1,-38.16 71.22,-57.12l139.95 -116.43c25.65,-21.34 44.63,-41.05 73.03,-62.72l140.11 -116.32c57.52,-43.34 67.85,-43.58 65.96,-70.48 -22.03,-5.06 -305.76,-244.28 -345.65,-278.95 -25.26,-21.96 -96.61,-71.8 -104.78,-96.08 -22.48,-8.1 -23.13,-7.09 -39.69,-23.14l-22.49 -25.2c-0.66,-2.89 -2.73,-3.23 -4.06,-4.87 -10.19,-2.35 -7.97,-2.05 -17.99,-8.69 -0.09,-0.06 -16.56,-13.43 -16.58,-13.45 -15.8,-12.84 -21.45,-10.49 -25.27,-27.5 -17.17,-10.61 -32.26,-17.88 -45.65,-29.69l-26.25 -29.02c-0.65,-2.84 -2.7,-3.16 -4,-4.77 -12.59,-3.25 -4.61,4.66 -20.6,-10.27l-2.03 438.21 -29.68 -10.36z"/>
   <path class="fil2" d="M9849.06 4879.82c83.88,4.08 161.79,3.55 241.36,22.28 29.51,3.11 75.42,7.12 93.79,26.1 41.31,-0.88 219.31,63.33 230.49,86.18 67.96,23.93 180.99,104.71 222.57,140.04l95.87 77.64c22.39,21.82 48.82,61.6 88.76,83.72l143.85 -165.09c-17.31,-17.06 -34.7,-28.94 -51.76,-46.88 -18.17,-19.12 -21.65,-31.56 -42.44,-47.88 -26.96,-21.16 -81.93,-60.26 -101.32,-90.3 -21.29,-4.22 -25.72,-11.39 -46.06,-26.55 -16.24,-12.11 -22.11,-16.72 -38.97,-28.88 -73.9,-53.3 -262.29,-143.83 -270.57,-151.47 -36.77,-7.78 -101.13,-24.79 -127.25,-48.44l-120.09 -25.52 -174.94 -24.97 -143.29 -6.85 0 226.87z"/>
  </g>
  <g id="_2152237487360">
   <path class="fil2" d="M13429.87 6577.92l1868.91 0c26.22,-13.79 64.74,-17.11 90.26,-29.8 31.93,-15.89 46.59,-36.02 75.11,-52.11 1.91,-13.55 22.53,-30.33 31.55,-44.84 43.64,-70.23 42.68,-126.41 42.67,-210.78l0 -833.58c0,-185.61 50.67,-177.75 -335.32,-168.95 -68.12,1.55 -64.7,39.81 -64.56,102.45l0.01 501.19c0,107.86 -5.6,231.61 0.88,337.53l-1548.55 0c0,-72.52 5.57,-876.89 -3.45,-905.01 -15.94,-49.67 -89.2,-35.97 -148.35,-35.97 -60.87,0 -123.75,-1.58 -184.35,-0.18 -74.77,1.72 -63.77,51.27 -63.75,117.8 0.07,243.77 0,487.54 0,731.3 0,170.8 -34.15,382.42 167.61,469.13 21.78,9.36 51.11,11.62 71.33,21.82z"/>
   <path class="fil2" d="M13812.35 4496.79c-6.97,20.13 -52.54,71.83 61.25,71.45 66.5,-0.23 233.72,-3.83 279.97,1.29 -5.21,56.67 -4.28,634.11 2.87,672.5 13.69,73.44 51.97,91.45 85.51,129.49 32.85,11.82 67.52,29.89 112.39,29.21 20.06,-0.3 39.84,-3.91 56.91,-9.09 23.99,-7.27 31.03,-15.04 48.96,-21.8 18.02,-16.01 36.15,-29.38 52.2,-50.4 19.29,-25.25 18.27,-43.25 31.75,-66.08l4.61 -66.45 0 -76.71 0 -76.72 0 -76.7 0 -76.72 0 -76.71 0 -76.71 0.25 -71.62 -0.25 -86.91c39.1,0 303,3.79 328.74,-3.73 39.14,-11.44 21.62,-39.76 16.69,-65.08 -18.79,-7.41 -7.95,-0.8 -13.3,-13.02l-526.46 -526.74 -4.57 0 -537.52 537.25z"/>
  </g>
 </g>
</svg>
