The following modules were not unloaded:
  (Use "module --force purge" to unload all):

  1) Stages/2022

  [01;33mThis stage is deprecated. Please consider moving to a new stage (2022
or newer)[0m

Setting HOROVOD_MPI_THREADS_DISABLE=1. 

The following have been reloaded with a version change:
  1) Stages/2022 => Stages/2020

2022-06-15 08:33:12.051309: I tensorflow/stream_executor/platform/default/dso_loader.cc:53] Successfully opened dynamic library libcudart.so.11.0
 * Running on http://127.0.0.1:12345/ (Press CTRL+C to quit)
 * Restarting with stat
2022-06-15 08:33:40.025900: I tensorflow/stream_executor/platform/default/dso_loader.cc:53] Successfully opened dynamic library libcudart.so.11.0
 * Debugger is active!
 * Debugger PIN: 123-170-231
