com\alkemytech\sophia\commons\score\TextScoreProvider$3.class
com\alkemytech\sophia\commons\index\ReverseIndex.class
com\alkemytech\sophia\commons\trie\LongBinding.class
com\alkemytech\sophia\commons\index\ReverseIndexImpl.class
com\alkemytech\sophia\commons\sqs\SqsMessagePump$Consumer.class
com\alkemytech\sophia\commons\score\LevenshteinScore.class
com\alkemytech\sophia\commons\util\TokenizableText.class
com\alkemytech\sophia\commons\query\AbstractAndQueryChain.class
com\alkemytech\sophia\commons\index\ReverseIndexImpl$SingleTermSet.class
com\alkemytech\sophia\commons\util\SplitCharSequence.class
com\alkemytech\sophia\commons\query\AbstractSmartQueryChain$1.class
com\alkemytech\sophia\commons\trie\LeafBinding.class
com\alkemytech\sophia\commons\mmap\ConcurrentMemoryMap$1.class
com\alkemytech\sophia\commons\score\WordWiseLevenshteinScore.class
com\alkemytech\sophia\commons\trie\ScoredPath.class
com\alkemytech\sophia\commons\index\LevenshteinIndexGroup.class
com\alkemytech\sophia\commons\index\SortedLinkedListDynamicIndex$NodeBinding.class
com\alkemytech\sophia\commons\mmap\ObjectCodec.class
com\alkemytech\sophia\commons\util\CharArray$Tokenizer.class
com\alkemytech\sophia\commons\text\LetterCase.class
com\alkemytech\sophia\commons\query\AbstractOrQueryChain.class
com\alkemytech\sophia\commons\text\RegExTextTokenizer.class
com\alkemytech\sophia\commons\aws\SQS.class
com\alkemytech\sophia\commons\index\LevenshteinIndexException.class
com\alkemytech\sophia\commons\score\WordWiseScore.class
com\alkemytech\sophia\commons\metric\Jaccard.class
com\alkemytech\sophia\commons\trie\TrieEx.class
com\alkemytech\sophia\commons\score\TextScoreProvider$4.class
com\alkemytech\sophia\commons\query\FuzzyTitleExactArtistQuery$1.class
com\alkemytech\sophia\commons\query\ExactTitleArtistQuery.class
com\alkemytech\sophia\commons\index\SortedLinkedListDynamicIndex$1.class
com\alkemytech\sophia\commons\aws\SQS$Msg.class
com\alkemytech\sophia\commons\index\SortedLinkedListDynamicIndex$SingleTermSet.class
com\alkemytech\sophia\commons\mmap\ConcurrentMemoryMap$Context.class
com\alkemytech\sophia\commons\query\FuzzyTitleArtistQuery$2.class
com\alkemytech\sophia\commons\trie\BooleanBinding.class
com\alkemytech\sophia\commons\util\IntegerSelector.class
com\alkemytech\sophia\commons\nosql\NoSql$Selector.class
com\alkemytech\sophia\commons\query\FuzzyAndQueryChain.class
com\alkemytech\sophia\commons\util\S3Utils.class
com\alkemytech\sophia\commons\jdbc\DBCP2DataSourceProvider.class
com\alkemytech\sophia\commons\trie\TrieHashMap$Bucket.class
com\alkemytech\sophia\commons\mmap\ConcurrentMemoryMap.class
com\alkemytech\sophia\commons\mmap\MemoryMap.class
com\alkemytech\sophia\commons\query\AbstractQueryChain.class
com\alkemytech\sophia\commons\query\ExactOrQueryChain.class
com\alkemytech\sophia\commons\sqs\MessageDeduplicator.class
com\alkemytech\sophia\commons\regex\RegExReplaceAll.class
com\alkemytech\sophia\commons\text\TextNormalizerProvider$1.class
com\alkemytech\sophia\commons\score\BerghelRoachScore.class
com\alkemytech\sophia\commons\util\FileUtils.class
com\alkemytech\sophia\commons\collecting\UUIDCode$1.class
com\alkemytech\sophia\commons\metric\DamerauLevenshtein.class
com\alkemytech\sophia\commons\distance\LevenshteinEditDistance.class
com\alkemytech\sophia\commons\nosql\ConcurrentNoSql$1.class
com\alkemytech\sophia\commons\index\SortedLinkedListDynamicIndex.class
com\alkemytech\sophia\commons\module\DynamicModule.class
com\alkemytech\sophia\commons\text\LetterCase$2.class
com\alkemytech\sophia\commons\index\LevenshteinIndexGroup$SingleTermSet.class
com\alkemytech\sophia\commons\util\OsUtils.class
com\alkemytech\sophia\commons\index\ReverseIndexImpl$ReverseIndexEditor.class
com\alkemytech\sophia\commons\nosql\NoSqlException.class
com\alkemytech\sophia\commons\query\QueryParser.class
com\alkemytech\sophia\commons\trie\Trie$NodeRef.class
com\alkemytech\sophia\commons\io\CompressionAwareFileInputStream.class
com\alkemytech\sophia\commons\sqs\McmdbMessageDeduplicator.class
com\alkemytech\sophia\commons\text\TextTokenizerProvider$1.class
com\alkemytech\sophia\commons\text\RegExTextNormalizer.class
com\alkemytech\sophia\commons\query\AbstractSmartQueryChain$2.class
com\alkemytech\sophia\commons\trie\ConcurrentTrieEx.class
com\alkemytech\sophia\commons\util\SortedKeyRefArray.class
com\alkemytech\sophia\commons\score\TextScore.class
com\alkemytech\sophia\commons\metric\Cosine.class
com\alkemytech\sophia\commons\trie\Trie$Node.class
com\alkemytech\sophia\commons\distance\BerghelRoachEditDistance.class
com\alkemytech\sophia\commons\index\LevenshteinIndex$TermSet.class
com\alkemytech\sophia\commons\text\LetterCase$1.class
com\alkemytech\sophia\commons\text\TextNormalizerProvider.class
com\alkemytech\sophia\commons\trie\Trie.class
com\alkemytech\sophia\commons\index\ReverseIndexImpl$1.class
com\alkemytech\sophia\commons\util\SizeInBytes.class
com\alkemytech\sophia\commons\sqs\SqsMessageHelper.class
com\alkemytech\sophia\commons\query\SmartTitleArtistQuery.class
com\alkemytech\sophia\commons\text\TextTokenizerProvider.class
com\alkemytech\sophia\commons\util\TextUtils.class
com\alkemytech\sophia\commons\index\SortedLinkedListDynamicIndex$Posting.class
com\alkemytech\sophia\commons\index\ReverseIndexProvider$1.class
com\alkemytech\sophia\commons\query\ExactAndQueryChain.class
com\alkemytech\sophia\commons\util\GsonUtils.class
com\alkemytech\sophia\commons\text\TextTokenizer.class
com\alkemytech\sophia\commons\trie\TrieHashMap$Node.class
com\alkemytech\sophia\commons\collecting\AdaCode$1.class
com\alkemytech\sophia\commons\trie\UUIDBinding.class
com\alkemytech\sophia\commons\guice\ConfigurationLoader.class
com\alkemytech\sophia\commons\query\QueryChain.class
com\alkemytech\sophia\commons\collecting\SiaeCode.class
com\alkemytech\sophia\commons\sqs\TrieMessageDeduplicator.class
com\alkemytech\sophia\commons\util\ListUtils.class
com\alkemytech\sophia\commons\collecting\UUIDCode.class
com\alkemytech\sophia\commons\metric\Levenshtein.class
com\alkemytech\sophia\commons\metric\NGrams.class
com\alkemytech\sophia\commons\http\HTTP$Response.class
com\alkemytech\sophia\commons\score\WordWiseBerghelRoachScore.class
com\alkemytech\sophia\commons\score\TextScoreProvider$6.class
com\alkemytech\sophia\commons\query\TitleArtistQuery.class
com\alkemytech\sophia\commons\util\MySqlUtils.class
com\alkemytech\sophia\commons\sqs\SqsS3Events.class
com\alkemytech\sophia\commons\distance\EditDistance.class
com\alkemytech\sophia\commons\util\IOUtils.class
com\alkemytech\sophia\commons\score\TextScoreProvider.class
com\alkemytech\sophia\commons\index\ReverseIndexProvider.class
com\alkemytech\sophia\commons\jdbc\DBCP2DataSource.class
com\alkemytech\sophia\commons\trie\IntegerBinding.class
com\alkemytech\sophia\commons\nosql\NoSql.class
com\alkemytech\sophia\commons\util\UuidUtils.class
com\alkemytech\sophia\commons\trie\TrieHashMap.class
com\alkemytech\sophia\commons\http\HTTP$1.class
com\alkemytech\sophia\commons\score\ArtistScore.class
com\alkemytech\sophia\commons\trie\TrieEx$Node.class
com\alkemytech\sophia\commons\text\TextNormalizer.class
com\alkemytech\sophia\commons\aws\S3$Url.class
com\alkemytech\sophia\commons\util\LongArray.class
com\alkemytech\sophia\commons\trie\ApproximateTrie.class
com\alkemytech\sophia\commons\io\CompressionAwareFileOutputStream.class
com\alkemytech\sophia\commons\query\FuzzyTitleArtistQuery$1.class
com\alkemytech\sophia\commons\query\AbstractSmartQueryChain.class
com\alkemytech\sophia\commons\net\CidrNetmask.class
com\alkemytech\sophia\commons\index\SortedLinkedListDynamicIndex$Node.class
com\alkemytech\sophia\commons\guice\Log4j2.class
com\alkemytech\sophia\commons\trie\ConcurrentTrieHashMap.class
com\alkemytech\sophia\commons\spelling\NumberSpeller.class
com\alkemytech\sophia\commons\query\FuzzyTitleExactArtistQuery.class
com\alkemytech\sophia\commons\trie\ConcurrentTrie.class
com\alkemytech\sophia\commons\collecting\AdaCode.class
com\alkemytech\sophia\commons\mmap\ConcurrentMemoryMap$ThreadLocalBuffer.class
com\alkemytech\sophia\commons\mmap\UnsafeMemoryMap.class
com\alkemytech\sophia\commons\sqs\SqsMessagePump.class
com\alkemytech\sophia\commons\util\BigDecimals.class
com\alkemytech\sophia\commons\index\SortedLinkedListDynamicIndex$MultipleTermSet.class
com\alkemytech\sophia\commons\util\CharArray.class
com\alkemytech\sophia\commons\score\TextScoreProvider$5.class
com\alkemytech\sophia\commons\collecting\SiaeCode$1.class
com\alkemytech\sophia\commons\text\LetterCase$3.class
com\alkemytech\sophia\commons\jdbc\GenericDAO.class
com\alkemytech\sophia\commons\aws\SQSExtendedClient.class
com\alkemytech\sophia\commons\query\FuzzyTitleExactArtistQuery$2.class
com\alkemytech\sophia\commons\query\ExactTitleArtistQuery$1.class
com\alkemytech\sophia\commons\query\SmartTitleArtistQuery$2.class
com\alkemytech\sophia\commons\index\LevenshteinIndex.class
com\alkemytech\sophia\commons\http\HTTP.class
com\alkemytech\sophia\commons\module\DynamicModuleException.class
com\alkemytech\sophia\commons\aws\S3$1.class
com\alkemytech\sophia\commons\mmap\MemoryMapException.class
com\alkemytech\sophia\commons\nosql\ConcurrentNoSql.class
com\alkemytech\sophia\commons\index\LevenshteinIndexGroup$MultipleTermSet.class
com\alkemytech\sophia\commons\query\ExactSmartQueryChain.class
com\alkemytech\sophia\commons\metric\SorensenDiceCoefficient.class
com\alkemytech\sophia\commons\index\ReverseIndex$Editor.class
com\alkemytech\sophia\commons\index\ReverseIndexImpl$Posting.class
com\alkemytech\sophia\commons\trie\ExactTrie.class
com\alkemytech\sophia\commons\trie\FixedLengthStringBinding.class
com\alkemytech\sophia\commons\query\FuzzyOrQueryChain.class
com\alkemytech\sophia\commons\util\HeartBeat.class
com\alkemytech\sophia\commons\nosql\NoSql$Converter.class
com\alkemytech\sophia\commons\score\TextScoreProvider$1.class
com\alkemytech\sophia\commons\jdbc\DBCP2DataSourceProvider$1.class
com\alkemytech\sophia\commons\query\FuzzySmartQueryChain.class
com\alkemytech\sophia\commons\util\GsonUtils$1.class
com\alkemytech\sophia\commons\sqs\SqsS3EventPump$Consumer.class
com\alkemytech\sophia\commons\nosql\NoSqlConfig.class
com\alkemytech\sophia\commons\nosql\NoSqlEntity.class
com\alkemytech\sophia\commons\sqs\SqsS3EventPump.class
com\alkemytech\sophia\commons\aws\S3.class
com\alkemytech\sophia\commons\regex\RegExTransformer.class
com\alkemytech\sophia\commons\guice\GuiceModule.class
com\alkemytech\sophia\commons\sqs\Iso8601Helper.class
com\alkemytech\sophia\commons\score\TextScoreProvider$2.class
com\alkemytech\sophia\commons\score\TitleScore.class
com\alkemytech\sophia\commons\util\GsonUtils$2.class
com\alkemytech\sophia\commons\index\ReverseIndexImpl$MultipleTermSet.class
com\alkemytech\sophia\commons\index\DynamicIndex.class
com\alkemytech\sophia\commons\index\LevenshteinIndex$TermSet$1.class
com\alkemytech\sophia\commons\mmap\ConcurrentMemoryMap$ThreadLocalContext.class
com\alkemytech\sophia\commons\metric\LongestCommonSubstring.class
com\alkemytech\sophia\commons\index\ReverseIndexImpl$ReverseIndexEditor$1.class
com\alkemytech\sophia\commons\query\SmartTitleArtistQuery$1.class
com\alkemytech\sophia\commons\query\TitleArtistQueryProvider.class
com\alkemytech\sophia\commons\util\ZipUtils.class
com\alkemytech\sophia\commons\query\FuzzyTitleArtistQuery.class
