C:\wp\sophia-common-master\src\main\java\com\alkemytech\sophia\common\mapper\TemplateMapperInterface.java
C:\wp\sophia-common-master\src\main\java\com\alkemytech\sophia\common\emr\EMRService.java
C:\wp\sophia-common-master\src\main\java\com\alkemytech\sophia\common\sqs\Iso8601Helper.java
C:\wp\sophia-common-master\src\main\java\com\alkemytech\sophia\common\net\IPv4Mask.java
C:\wp\sophia-common-master\src\main\java\com\alkemytech\sophia\common\kb\LessonCa.java
C:\wp\sophia-common-master\src\main\java\com\alkemytech\sophia\common\tools\Log4j2Tools.java
C:\wp\sophia-common-master\src\main\java\com\alkemytech\sophia\common\mapper\TemplateMapper.java
C:\wp\sophia-common-master\src\main\java\com\alkemytech\sophia\common\dao\McmdbDAO.java
C:\wp\sophia-common-master\src\main\java\com\alkemytech\sophia\common\kb\SophiaCaOpera.java
C:\wp\sophia-common-master\src\main\java\com\alkemytech\sophia\common\s3\S3Service.java
C:\wp\sophia-common-master\src\main\java\com\alkemytech\sophia\common\kb\Learning.java
C:\wp\sophia-common-master\src\main\java\com\alkemytech\sophia\common\kb\SophiaIdsongOpera.java
C:\wp\sophia-common-master\src\main\java\com\alkemytech\sophia\common\beantocsv\CustomMappingStrategy.java
C:\wp\sophia-common-master\src\main\java\com\alkemytech\sophia\common\kb\ConflictingCa.java
C:\wp\sophia-common-master\src\main\java\com\alkemytech\sophia\common\tools\DateTools.java
C:\wp\sophia-common-master\src\main\java\com\alkemytech\sophia\common\kb\KbException.java
C:\wp\sophia-common-master\src\main\java\com\alkemytech\sophia\common\kb\ConflictingIswc.java
C:\wp\sophia-common-master\src\main\java\com\alkemytech\sophia\common\kb\ConflictingIsrc.java
C:\wp\sophia-common-master\src\main\java\com\alkemytech\sophia\common\mapper\XlsMapperConfiguration.java
C:\wp\sophia-common-master\src\main\java\com\alkemytech\sophia\common\kb\SophiaIswcOpera.java
C:\wp\sophia-common-master\src\main\java\com\alkemytech\sophia\common\sqs\SQSService.java
C:\wp\sophia-common-master\src\main\java\com\alkemytech\sophia\common\tools\StringTools.java
C:\wp\sophia-common-master\src\main\java\com\alkemytech\sophia\common\sqs\SQSMessage.java
C:\wp\sophia-common-master\src\main\java\com\alkemytech\sophia\common\dao\DsrInfo.java
C:\wp\sophia-common-master\src\main\java\com\alkemytech\sophia\common\kb\LessonIsrc.java
C:\wp\sophia-common-master\src\main\java\com\alkemytech\sophia\common\kb\LessonIswc.java
C:\wp\sophia-common-master\src\main\java\com\alkemytech\sophia\common\s3\S3Events.java
C:\wp\sophia-common-master\src\main\java\com\alkemytech\sophia\common\kb\LessonIdsong.java
C:\wp\sophia-common-master\src\main\java\com\alkemytech\sophia\common\kb\Management.java
C:\wp\sophia-common-master\src\main\java\com\alkemytech\sophia\common\kb\ConflictingIdsong.java
C:\wp\sophia-common-master\src\main\java\com\alkemytech\sophia\common\rest\RestClient.java
C:\wp\sophia-common-master\src\main\java\com\alkemytech\sophia\common\kb\SophiaIsrcOpera.java
C:\wp\sophia-common-master\src\main\java\com\alkemytech\sophia\common\Constants.java
C:\wp\sophia-common-master\src\main\java\com\alkemytech\sophia\common\dbcp\DBCPDataSourceProvider.java
C:\wp\sophia-common-master\src\main\java\com\alkemytech\sophia\common\megaconcert\MegaConcertUtils.java
C:\wp\sophia-common-master\src\main\java\com\alkemytech\sophia\common\config\ConfigurationLoader.java
C:\wp\sophia-common-master\src\main\java\com\alkemytech\sophia\common\json\GsonAdapter.java
