{
  <% if (header!=null) {%>

"header": {
"codiceProcesso": "FATT04",
"destinatario": "SAP",
"messaggi": [
{
"id": <% out << header.uuid %>,
"timeStamp": <%  out << header.timeStamp %>
}
],
"mittente": "SOPHIA",
"tipoElaborazione": "S",
"userName": ""
},
<%
}
%>

"requestData": {
"datiFattura": {
"attribuzione": <% out << datiFattura.attribuzione%>,
"codiceCliente": <% out << datiFattura.codiceCliente %>,
"dataAccredito": <% out << datiFattura.dataAccredito%>,
"dataCompetenza": <% out << datiFattura.dataCompetenza%>,
"dataDocumento": <% out << datiFattura.dataDocumento %>,
"divisione": <% out << datiFattura.divisione%>,
"idRichiesta": <% out << datiFattura.idRichiesta%>,
"posizioni" :{ "posizione": [  <%for ( int i =0; i< datiFattura.posizioni.size();i++) {%>
{
"codiceMateriale": <% out << datiFattura.posizioni[i].codiceMateriale%>,
"importoMateriale": <% out << datiFattura.posizioni[i].prezzoUnitario%>,
"numeroPosizione": <% out << datiFattura.posizioni[i].numeroPosizione%>,
"quantitaMateriale": <% out << datiFattura.posizioni[i].quantita%>,
"testoPosizione":{ "riga":[ <% out << datiFattura.posizioni[i].descrizioneMateriale%>]}
}
<%  if (i< datiFattura.posizioni.size()-1 ) { out << ','}%>
<%}%>
]},

"testoTestata": <% out << datiFattura.testoTestata %>,
"tipoDocumento": <% out << datiFattura.tipoDocumento%>,
"incoterms2": <% out << datiFattura.incoterms2%>
}
,
"datiStampa": {
"annotazioni":  <% out << datiStampa.annotazioni%>,
"annotazioniStrumenti":{
"strumento": [{}]
}

}
}



}