
# WARNING: use with upper-case strings only


# titoli con opera, numero, volume, versione, etc.
"(\(|\s)(?:OP)\.?\-?\s*(\d+)", "$1OP$2"
"(\(|\s)(?:N|NR|NO)\.?\-?\s*(\d+)", "$1N$2"
"(\(|\s)(?:D)\.?\-?\s*(\d+)", "$1D$2"
"(\(|\s)(?:A)\.?\-?\s*(\d+)", "$1A$2"
"(\(|\s)(?:VOL|VOLUME)\.?\-?\s*(\d+)", "$1VOL$2"
"(\(|\s)(?:VER|V|VERSION|VERSIONE)\.?\-?\s*(\d+)", "$1V$2"

# optimizations
#"\b(AIN[\s\']T)\b", "AINT"
#"\b(DON[\s\']T)\b", "DONT"
#"\b(ISN[\s\']T)\b", "ISNT"

#"\b(I[\s\']M)\b", "IM"
#"\b(HE[\s\']S)\b", "HES"
#"\b(SHE[\s\']S)\b", "SHES"
#"\b(IT[\s\']S)\b", "ITS"
