
# WARNING: use with lower-case strings only


#".*\b(aa\svv|artisti\svari|autore\ssconosciuto|compositore\ssconosciuto|sconosciuto|anonimo|imprecisato|imperecisato|v\.siae\s\d+|vedi\ssiae\s\d+)\b.*", ""
"(aa\svv|artisti\svari|autore\ssconosciuto|compositore\ssconosciuto|sconosciuto|anonimo|imprecisato|imperecisato|v\.siae\s\d+|vedi\ssiae\s\d+)", ""



