{
  <% if (header!=null) {%>

"header": {
"codiceProcesso": "FATT04",
"destinatario": "SAP",
"messaggi": [
{
"id": <% out << header.uuid %>,
"riferimento": <%  out << header.riferimento %>,
"timeStamp": <%  out << header.timeStamp %>
}
],
"mittente": "SOPHIA",
"tipoElaborazione": "S",
"userName": "SOPHIA"
},
<%
}
%>

"requestData": {
"datiFattura": {
"attribuzione": <% out << datiFattura.attribuzione%>,
"codiceCliente": <% out << datiFattura.codiceCliente %>,
"codiceOperazione": "FATT04",
"codiceUfficio": <% out << datiFattura.codiceUfficio %>,
"dataAccredito": <% out << datiFattura.dataAccredito%>,
"dataCompetenza": <% out << datiFattura.dataCompetenza%>,
"dataDocumento": <% out << datiFattura.dataDocumento %>,
"dataFineValidita": <% out << datiFattura.dataFineValidita%>,
"dataInizioValidita":<% out << datiFattura.dataInizioValidita%>,
"dataPagamento": <% out << datiFattura.dataPagamento%>,
"divisione": <% out << datiFattura.divisione%>,
"idDocumentoRiferimento":<% out << datiFattura.idDocumentoRiferimento%>,
"idRichiesta": <% out << datiFattura.idRichiesta%>,
"incoterms2": <% out << datiFattura.incoterms2%>,
"metodoPagamento": <% out << datiFattura.metodoPagamento%>,
"posizioni" :{ "posizione": [  <%for ( int i =0; i< datiFattura.posizioni.size();i++) {%>
{
"codiceDichiarazione": <% out << datiFattura.posizioni[i].codiceDichiarazione%>,
"codiceIva": <% out << datiFattura.posizioni[i].codiceIva%>,
"codiceMateriale": <% out << datiFattura.posizioni[i].codiceMateriale%>,
"importoMateriale": <% out << datiFattura.posizioni[i].importoMateriale%>,
"numeroPosizione": <% out << datiFattura.posizioni[i].numeroPosizione%>,
"quantitaMateriale": <% out << datiFattura.posizioni[i].quantitaMateriale%>,
"testoPosizione":{ "riga":[ <% out << datiFattura.posizioni[i].testoPosizione%>]}
}
<%  if (i< datiFattura.posizioni.size()-1 ) { out << ','}%>
<%}%>
]},
"riferimenti": {
"codiceCIG": <% out << datiFattura.riferimenti.codiceCIG %>,
"codiceCUP": <% out << datiFattura.riferimenti.codiceCUP %>,
"codiceCommessaConvenzione": <% out << datiFattura.riferimenti.codiceCommessaConvenzione %>,
"data": <% out << datiFattura.riferimenti.data %>,
"idDocumento":<% out << datiFattura.riferimenti.idDocumento %>,
"numItem": <% out << datiFattura.riferimenti.numItem %>,
"riferimentoNumeroLinea": <% out << datiFattura.riferimenti.riferimentoNumeroLinea %>,
"tipo": <% out << datiFattura.riferimenti.tipo %>
},
"rimborsoIvaScaduto": <% out << datiFattura.rimborsoIvaScaduto%>,
"seprag": <% out << datiFattura.seprag%>,
"testoTestata": <% out << datiFattura.testoTestata %>,
"tipoDocumento": <% out << datiFattura.tipoDocumento%>,
"tipoMovimento": <% out << datiFattura.tipoMovimento%>,
"totaleDocumento": <% out << datiFattura.totaleDocumento%>
},
"datiStampa": {
"annotazioni":  <% out << datiStampa.annotazioni%>,
"annotazioniStrumenti":{
"strumento": [{}]
},
"associazioneAccordoSMAD": <% out << datiStampa.associazioneAccordoSmad%>,
"associazionePeriodoAl": <% out << datiStampa.associazionePeriodoAl%>,
"associazionePeriodoDal": <% out << datiStampa.associazionePeriodoDal%>,
"clienteCittaDelegatoRimborso": <% out << datiStampa.clienteCittaDelegatoRimborso%>,
"clienteDelegatoRimborso": <% out << datiStampa.clienteDelegatoRimborso%>,
"clienteDocumentoDelegato": <% out << datiStampa.clienteDocumentoDelegato%>,
"clienteOpzioneLegge398": <% out << datiStampa.clienteOpzioneLegge398%>,
"localeCap": <% out << datiStampa.localeCap%>,
"localeCategoriaLocale": <% out << datiStampa.localeCategoriaLocale%>,
"localeCodiceBA": <% out << datiStampa.localeCodiceBA%>,
"localeCodiceComune": <% out << datiStampa.localeCodiceComune%>,
"localeCodiceSpei": <% out << datiStampa.localeCodiceSpei%>,
"localeDenominazione": <% out << datiStampa.localeDenominazione%>,
"localeGenereLocale": <% out << datiStampa.localeGenereLocale%>,
"localeIndirizzo": <% out << datiStampa.localeIndirizzo%>,
"localeLocalita": <% out << datiStampa.localeLocalita%>,
"localeTitolare": <% out << datiStampa.localeTitolare%>,
"manifestazioneAutore": <% out << datiStampa.manifestazioneAutore%>,
"manifestazioneCodOperaTeatrale": <% out << datiStampa.manifestazioneCodOperaTeatrale%>,
"manifestazioneCodiceGenereManifestazione": <% out << datiStampa.manifestazioneCodiceGenereManifestazione%>,
"manifestazioneDataFineManifestazione": <% out << datiStampa.manifestazioneDataFineManifestazione%>,
"manifestazioneDataInizioManifestazione": <% out << datiStampa.manifestazioneDataInizioManifestazione%>,
"manifestazioneDataPermesso": <% out << datiStampa.manifestazioneDataPermesso%>,
"manifestazioneGenereManifestazione": <% out << datiStampa.manifestazioneGenereManifestazione%>,
"manifestazioneNumPermesso": <% out << datiStampa.manifestazioneNumPermesso%>,
"manifestazioneNumeroEventi": <% out << datiStampa.manifestazioneNumeroEventi%>,
"manifestazioneNumeroGiornate": <% out << datiStampa.manifestazioneNumeroGiornate%>,
"manifestazioneTitoloLavoro": <% out << datiStampa.manifestazioneTitoloLavoro%>,
"riepilogoBigliettiEsitati": <% out << datiStampa.riepilogoBigliettiEsitati%>,
"riepilogoIncassoNetto": <% out << datiStampa.riepilogoIncassoNetto%>,
"riepilogoNumeroFinaleDichiarazione": <% out << datiStampa.riepilogoNumeroFinaleDichiarazione%>,
"riepilogoNumeroFinaleDistinta": <% out << datiStampa.riepilogoNumeroFinaleDistinta%>,
"riepilogoNumeroInizialeDichiarazione": <% out << datiStampa.riepilogoNumeroInizialeDichiarazione%>,
"riepilogoNumeroInizialeDistinta": <% out << datiStampa.riepilogoNumeroInizialeDistinta%>,
"riepilogoPresenze": <% out << datiStampa.riepilogoPresenze%>,
"riepilogoTotaleDichiarazioni":<% out << datiStampa.riepilogoTotaleDichiarazioni%>,
"riepilogoTotaleDistinte": <% out << datiStampa.riepilogoTotaleDistinte%>,
"riferimentiCodicePrag": <% out << datiStampa.riferimentiCodicePrag%>,
"riferimentiDataFatturaRiferimento": <% out << datiStampa.riferimentiDataFatturaRiferimento%>,
"riferimentiDescrizioneAgenzia": <% out << datiStampa.riferimentiDescrizioneAgenzia%>,
"riferimentiDescrizioneSede": <% out << datiStampa.riferimentiDescrizioneSede%>,
"riferimentiFatturaRiferimento": <% out << datiStampa.riferimentiFatturariferimento%>,
"riferimentiNumeroReversale": <% out << datiStampa.riferimentiNumeroReversale%>

}
}



}