
# WARNING: use with lower-case strings only


# artisti con cognomi italiani (con preposizione tra parentesi) solo documentazione
#"(.*)(?:\s?\()(i|d\'?|l\'?|di|de|da|la|le|lo|li|del|dal|dell\'?|dall\'?|dalla|della|dello)(?:\)\s?)(.*)", "$2 $1 $3"

# artisti con cognomi stranieri (con preposizione tra parentesi) solo documentazione
#"(.*)(?:\s?\()(th\s?e|van|von|van\sde|van\sder|do|dos|du|van\sden|van\-der|den|du|de\sla|de\s?l|de\slas|de\-la|les|le\s?s|le|los|vanden|von\sder|van\-de)(?:\)\s?)(.*)", "$2 $1 $3"

# WARNING: impossibile distinguere tra (de) nazione e preposizione
# artisti eliminazione sigle nazionali tra parentesi (con o senza numero)
#"(.*)(?:\s?\()(it|uk|de|au|fr|gb|us|usa|kr|pt|es|tw|dk|hk|be|jp|at|se|nl|ne|gr|pl|ch|pp|sr|mc|sc|br|tt|ie|co|ar|rs|ja|nv|hr|jm|in|ra|ve|yv|tr|ns|nm|cu|si|sn|dz|za|ry|sw|me|wp|zt|bj|uy)(?:\s*\d*\)\s?)(.*)", "$1 $3"

# artisti eliminazione keyword tra parentesi
#"(.*)(?:\s?\()(prs|mcps|protected shares|non protected|non protected shares|non\-protected share|non\-protected shares|not in use|n\'est plus utilise|niet meer gebruikt)(?:\)\s?)(.*)", "$1 $3"

# artisti eliminazione numeri tra parentesi
#"(.*)(?:\s?\()(\d+)(?:\)\s?)(.*)", "$1 $3"




