

2018-11-09 19:06:26,970 DEBUG [main] UlisseIpiJson query executed in 25s296ms
2018-11-09 19:08:44,242 DEBUG [main] UlisseIpiJson total ipi(s) 7856382
2018-11-09 19:08:44,243 DEBUG [main] UlisseIpiJson ipi export completed in 2m42s569ms
1	./ipi.nosql/catalog
300	./ipi.nosql/records
510	./ipi.nosql/primary
809	./ipi.nosql
840	./ipi_reverse.trie


2018-11-09 19:09:04,257 DEBUG [main] UlisseIpiJson query executed in 20s10ms
2018-11-09 19:11:50,559 DEBUG [main] UlisseIpiJson total codici(s) 19892578
2018-11-09 19:11:50,560 DEBUG [main] UlisseIpiJson codici export completed in 3m6s313ms
1	./codici.nosql/catalog
366	./codici.nosql/records
530	./codici.nosql/primary
896	./codici.nosql


2018-11-09 19:12:12,804 DEBUG [main] UlisseIpiJson query executed in 22s169ms
2018-11-09 19:14:57,844 DEBUG [main] UlisseIpiJson total titoli(s) 19268948
2018-11-09 19:14:57,845 DEBUG [main] UlisseIpiJson titoli export completed in 3m7s210ms
1	./titoli.nosql/catalog
461	./titoli.nosql/records
556	./titoli.nosql/primary
1016	./titoli.nosql


2018-11-09 19:14:57,884 DEBUG [main] UlisseIpiJson query executed in 33ms
2018-11-09 19:14:57,884 DEBUG [main] UlisseIpiJson total interpreti(s) 0
2018-11-09 19:14:57,884 DEBUG [main] UlisseIpiJson interpreti export completed in 33ms
1	./interpreti.nosql/catalog
0	./interpreti.nosql/records
1	./interpreti.nosql/primary
1	./interpreti.nosql


2018-11-09 19:20:23,535 DEBUG [main] UlisseIpiJson query executed in 5m25s650ms
2018-11-09 19:23:46,942 DEBUG [main] UlisseIpiJson total flags(s) 15748564
2018-11-09 19:23:46,943 DEBUG [main] UlisseIpiJson flags export completed in 8m49s58ms
468	./flags.trie


2018-11-09 19:32:16,906 DEBUG [main] UlisseIpiJson query executed in 8m29s963ms
2018-11-09 21:15:52,295 DEBUG [main] UlisseIpiJson total quote(s) 154030675
2018-11-09 21:15:52,296 DEBUG [main] UlisseIpiJson quote export completed in 1h52m5s353ms


2018-11-09 21:15:52,312 INFO [main] UlisseIpiJson export completed in 2h9m50s695ms







