
# WARNING: use with lower-case strings only


# titoli con opera, numero, volume, versione, etc.
#"(\(|\s)(?:op|opera)\.?\-?\s*(\d+)", "$1op$2"
#"(\(|\s)(?:n|nr|no|num|number|numero)\.?\-?\s*(\d+)", "$1n$2"
#"(\(|\s)(?:vol|volume)\.?\-?\s*(\d+)", "$1vol$2"
#"(\(|\s)(?:ver|v|version|versione)\.?\-?\s*(\d+)", "$1v$2"
#"(\(|\s)(?:d)\.?\-?\s*(\d+)", "$1d$2"
#"(\(|\s)(?:a)\.?\-?\s*(\d+)", "$1a$2"

# optimizations
#"\b(ain[\s\']t)\b", "aint"
#"\b(don[\s\']t)\b", "dont"
#"\b(isn[\s\']t)\b", "isnt"
#"\b(can[\s\']t)\b", "cant"
#"\b(won[\s\']t)\b", "wont"
#"\b(([a-z]+)[\s\']t)\b", "$1t"

#"\b(i[\s\']m)\b", "im"
#"\b(you[\s\']re)\b", "youre"
#"\b(he[\s\']s)\b", "hes"
#"\b(she[\s\']s)\b", "shes"
#"\b(it[\s\']s)\b", "its"
#"\b(we[\s\']re)\b", "were"
#"\b(that[\s\']s)\b", "thats"
#"\b(what[\s\']s)\b", "whats"
#"\b(where[\s\']s)\b", "wheres"
#"\b(([a-z]+)[\s\']s)\b", "$1s"
#"\b(([a-z]+)[\s\']re)\b", "$1re"

# dates
#"(\d{1,2})\.(\d{1,2})\.(\d{2,4})", "$1-$2-$3"
#"(jan|feb|mar|apr|may|jun|jul|aug|sep|oct|nov|dec)\s*(\d{1,2})\,?\s*(\d{2,4})", "$2-$1-$3"


