module mvcgolang

go 1.15

require (
	github.com/dgrijalva/jwt-go v3.2.0+incompatible
	github.com/gin-contrib/cors v1.3.1
	github.com/gin-gonic/gin v1.6.3
	github.com/go-playground/validator/v10 v10.4.1 // indirect
	github.com/golang/protobuf v1.4.3 // indirect
	github.com/google/go-cmp v0.5.2 // indirect
	github.com/json-iterator/go v1.1.10 // indirect
	github.com/mitchellh/mapstructure v1.3.3
	github.com/modern-go/concurrent v0.0.0-20180306012644-bacd9c7ef1dd // indirect
	github.com/modern-go/reflect2 v1.0.1 // indirect
	github.com/pkg/errors v0.9.1
	github.com/stretchr/testify v1.6.1 // indirect
	github.com/ugorji/go v1.1.13 // indirect
	golang.org/x/crypto v0.0.0-20201016220609-9e8e0b390897 // indirect
	golang.org/x/sys v0.0.0-20201101102859-da207088b7d1 // indirect
	google.golang.org/protobuf v1.25.0 // indirect
	gopkg.in/yaml.v2 v2.3.0 // indirect
	gorm.io/driver/mysql v1.0.3
	gorm.io/gorm v1.20.5
)
