{
  "compilerOptions": {
    "target": "ES2018",
    "module": "ESNext",
    "moduleResolution": "Node",
    "lib": [
      "esnext",
      "esnext.asynciterable",
      "dom"
    ],
    "esModuleInterop": true,
    "resolveJsonModule": true,
    "experimentalDecorators": true,
    "allowSyntheticDefaultImports": true,
    "sourceMap": true,
    "baseUrl": "./src",
    "paths": {
      "~/*": [
        "./*"
      ],
      "@/*": [
        "./*"
      ]
    }
  },
  "exclude": [
    "node_modules"
  ]
}
