+ test
- test
+ ticket_technical_help
+ ticket_category
+ ticket_title
+ ticket_message
+ ticket_displayer_help
+ ticket_general_help
+ ticket_rename_help
+ Propositions
+ Additionnal Informations
+ Informations of Origin Account
+ Informations of Destination Account
+ Additionnal Informations
+ ticket_restore_help
+ Informations
+ Additionnal Informations
+ what_happens
+ what_do_you_want_to_do
+ what_did_you_expect
+ ticket_technical_infos1
+ ticket_technical_infos2
+ ticket_technical_infos3
+ Additionnal Informations
+ Informations of Origin Account
+ Informations of Destination Account
+ Additionnal Informations
+ Additionnal Informations
+ Additionnal Informations
+ Additionnal Informations
+ Additionnal Informations
+ Informations of Origin Account
+ Informations of Destination Account
+ Additionnal Informations
+ Additionnal Informations
+ Additionnal Informations
+ Additionnal Informations
+ Additionnal Informations
+ Additionnal Informations
+ Additionnal Informations
+ Additionnal Informations
+ Additionnal Informations
+ Informations of Origin Account
+ Informations of Destination Account
+ Additionnal Informations
+ Additionnal Informations
+ Additionnal Informations
+ Additionnal Informations
+ Additionnal Informations
+ Additionnal Informations
+ Additionnal Informations
+ Additionnal Informations
+ Additionnal Informations
+ Informations of Origin Account
+ Informations of Destination Account
+ Additionnal Informations
+ Additionnal Informations
+ Additionnal Informations
+ Ticket_help
- ticket_help
- Ticket_help
+ ticket_help
+ Additionnal Informations
+ Informations of Origin Account
+ Informations of Destination Account
+ Additionnal Informations
+ Additionnal Informations
+ Additionnal Informations
+ Additionnal Informations
+ Additionnal Informations
+ Additionnal Informations
+ Informations of Origin Account
+ Informations of Destination Account
+ Additionnal Informations
+ Additionnal Informations
+ Additionnal Informations
+ Additionnal Informations
+ Informations of Origin Account
+ Informations of Destination Account
+ Additionnal Informations
+ Additionnal Informations
+ Additionnal Informations
+ Additionnal Informations
+ Informations of Origin Account
+ Informations of Destination Account
+ Additionnal Informations
+ Additionnal Informations
+ Additionnal Informations
+ Additionnal Informations
+ Additionnal Informations
+ Informations of Origin Account
+ Informations of Destination Account
+ Additionnal Informations
+ Additionnal Informations
+ Informations of Origin Account
+ Informations of Destination Account
+ Additionnal Informations
+ Additionnal Informations
+ Additionnal Informations
+ Informations of Origin Account
+ Informations of Destination Account
+ Additionnal Informations
+ Informations of Origin Account
+ Informations of Destination Account
+ Additionnal Informations
+ Additionnal Informations
+ Informations of Origin Account
+ Informations of Destination Account
+ Additionnal Informations
+ Additionnal Informations
+ Additionnal Informations
+ Informations of Origin Account
+ Informations of Destination Account
+ Additionnal Informations
+ Additionnal Informations
+ back_home
+ submit
+ answer_ticket
+ ticket_answer
- ticket_answer
- answer_ticket
+ ticket_answer
+ support
+ ticket_new
+ ticket_open
+ ticket_wip
+ ticket_closed
+ ticket_done
+ ticket_spam
+ send
+ submit_note
+ submit_message
+ validate-channel-change
+ cancel
+ Additionnal Informations
+ Informations of Origin Account
+ Informations of Destination Account
+ Additionnal Informations
+ Additionnal Informations
+ Informations of Origin Account
+ Informations of Destination Account
+ Additionnal Informations
+ Additionnal Informations
+ Informations of Origin Account
+ Informations of Destination Account
+ Additionnal Informations
+ Additionnal Informations
+ Additionnal Informations
+ Additionnal Informations
+ Additionnal Informations
+ ticket_displayer_subject
+ ticket_general_subject
+ ticket_technical_subject
+ Additionnal Informations
+ Additionnal Informations
+ Informations of Origin Account
+ Informations of Destination Account
+ Additionnal Informations
+ Additionnal Informations
+ ticket_restore_subject
+ Additionnal Informations
+ Informations of Origin Account
+ Informations of Destination Account
+ Additionnal Informations
+ Additionnal Informations
+ Additionnal Informations
+ Additionnal Informations
+ Additionnal Informations
+ Informations of Origin Account
+ Informations of Destination Account
+ Additionnal Informations
+ Additionnal Informations
+ Informations of Origin Account
+ Informations of Destination Account
+ Additionnal Informations
+ Additionnal Informations
+ Additionnal Informations
+ Informations of Origin Account
+ Informations of Destination Account
+ Additionnal Informations
+ ticket_transfert_subject
+ Informations of Origin Account
+ Informations of Destination Account
+ Additionnal Informations
+ Additionnal Informations
+ Additionnal Informations
+ Additionnal Informations
+ ticket_rename_subject
+ Additionnal Informations
+ _help
+ _help
+ _help
+ _help
+ Additionnal Informations
+ Additionnal Informations
+ Additionnal Informations
+ Additionnal Informations
+ Additionnal Informations
+ Additionnal Informations
+ ticket_account
+ Additionnal Informations
+ _Ticket_account
- _Ticket_account
+ Additionnal Informations
+ Additionnal Informations
+ Informations of Origin Account
+ Informations of Destination Account
+ Additionnal Informations
+ Informations of Origin Account
+ Informations of Destination Account
+ Additionnal Informations
+ Informations of Origin Account
+ Informations of Destination Account
+ Additionnal Informations
+ Additionnal Informations
+ Additionnal Informations
+ Additionnal Informations
+ Informations of Origin Account
+ Informations of Destination Account
+ Additionnal Informations
+ Additionnal Informations
+ Additionnal Informations
+ Additionnal Informations
+ Informations of Origin Account
+ Informations of Destination Account
+ Additionnal Informations
+ Additionnal Informations
+ Informations of Origin Account
+ Informations of Destination Account
+ Additionnal Informations
+ Additionnal Informations
+ Informations of Origin Account
+ Informations of Destination Account
+ Additionnal Informations
+ Additionnal Informations
+ Informations of Origin Account
+ Informations of Destination Account
+ Additionnal Informations
+ Additionnal Informations
+ Additionnal Informations
+ Additionnal Informations
+ Additionnal Informations
+ Informations of Origin Account
+ Informations of Destination Account
+ Additionnal Informations
+ Additionnal Informations
+ Additionnal Informations
+ Additionnal Informations
+ Additionnal Informations
+ Additionnal Informations
+ Additionnal Informations
+ Additionnal Informations
+ Additionnal Informations
+ Informations of Origin Account
+ Informations of Destination Account
+ Additionnal Informations
+ validate-agent-change
+ Additionnal Informations
+ Informations of Origin Account
+ Informations of Destination Account
+ Additionnal Informations
+ Additionnal Informations
+ Additionnal Informations
+ Informations of Origin Account
+ Informations of Destination Account
+ Additionnal Informations
+ Additionnal Informations
+ Additionnal Informations
+ Informations of Origin Account
+ Informations of Destination Account
+ Additionnal Informations
+ Additionnal Informations
+ Additionnal Informations
+ Informations of Origin Account
+ Informations of Destination Account
+ Additionnal Informations
+ Additionnal Informations
+ Additionnal Informations
+ Additionnal Informations
+ Additionnal Informations
+ Additionnal Informations
+ Additionnal Informations
+ Informations of Origin Account
+ Informations of Destination Account
+ Additionnal Informations
+ Additionnal Informations
+ Additionnal Informations
+ Additionnal Informations
+ Informations of Origin Account
+ Informations of Destination Account
+ Additionnal Informations
+ Additionnal Informations
+ Additionnal Informations
+ ticket_email
+ Additionnal Informations
+ Informations of Origin Account
+ Informations of Destination Account
+ Additionnal Informations
+ Additionnal Informations
+ Informations of Origin Account
+ Informations of Destination Account
+ Additionnal Informations
+ Additionnal Informations
+ Informations of Origin Account
+ Informations of Destination Account
+ Additionnal Informations
+ Additionnal Informations
+ Additionnal Informations
+ Informations of Origin Account
+ Informations of Destination Account
+ Additionnal Informations
+ Additionnal Informations
+ Additionnal Informations
+ Informations of Origin Account
+ Informations of Destination Account
+ Additionnal Informations
+ Additionnal Informations
+ ticket_section
+ ticket-new-section-bugs
+ ticket-new-section-crash
+ ticket-new-section-missions
+ ticket-new-section-patch
+ Additionnal Informations
+ Informations of Origin Account
+ Informations of Destination Account
+ Additionnal Informations
+ Additionnal Informations
+ Additionnal Informations
+ Additionnal Informations
+ Additionnal Informations
+ Informations of Origin Account
+ Informations of Destination Account
+ Additionnal Informations
+ Additionnal Informations
+ Additionnal Informations
+ Informations of Origin Account
+ Informations of Destination Account
+ Additionnal Informations
+ Additionnal Informations
+ Additionnal Informations
+ Additionnal Informations
+ Informations of Origin Account
+ Informations of Destination Account
+ Additionnal Informations
+ Additionnal Informations
+ Informations of Origin Account
+ Informations of Destination Account
+ Additionnal Informations
+ Additionnal Informations
+ Additionnal Informations
+ Informations of Origin Account
+ Informations of Destination Account
+ Additionnal Informations
+ Additionnal Informations
+ Additionnal Informations
+ Additionnal Informations
+ Additionnal Informations
+ mission_name
+ operating_system
+ Additionnal Informations
+ Additionnal Informations
+ Additionnal Informations
+ Informations of Origin Account
+ Informations of Destination Account
+ Additionnal Informations
+ ticket_content
+ Informations of Origin Account
+ Informations of Destination Account
+ ticket_General_help
+ Informations of Origin Account
+ Informations of Destination Account
+ mission_giver
+ Informations of Origin Account
+ Informations of Destination Account
+ Informations of Origin Account
+ Informations of Destination Account
+ Informations of Origin Account
+ Informations of Destination Account
+ Informations of Origin Account
+ Informations of Destination Account
+ Informations of Origin Account
+ Informations of Destination Account
+ Informations of Origin Account
+ Informations of Destination Account
+ Informations of Origin Account
+ Informations of Destination Account
+ Informations of Origin Account
+ Informations of Destination Account
+ Informations of Origin Account
+ Informations of Destination Account
+ Informations of Origin Account
+ Informations of Destination Account
+ Informations of Origin Account
+ Informations of Destination Account
+ Informations of Origin Account
+ Informations of Destination Account
+ Informations of Origin Account
+ Informations of Destination Account
+ Informations of Origin Account
+ Informations of Destination Account
+ Informations of Origin Account
+ Informations of Destination Account
+ Informations of Origin Account
+ Informations of Destination Account
+ Informations of Origin Account
+ Informations of Destination Account
+ attachments
+ Informations of Origin Account
+ Informations of Destination Account
+ Informations of Origin Account
+ Informations of Destination Account
+ Informations of Origin Account
+ Informations of Destination Account
+ Informations of Origin Account
+ Informations of Destination Account
+ Informations of Origin Account
+ Informations of Destination Account
+ Informations of Origin Account
+ Informations of Destination Account
+ Informations of Origin Account
+ Informations of Destination Account
+ Informations of Origin Account
+ Informations of Destination Account
+ Informations of Origin Account
+ Informations of Destination Account
+ Informations of Origin Account
+ Informations of Destination Account
+ Informations of Origin Account
+ Informations of Destination Account
+ Informations of Origin Account
+ Informations of Destination Account
+ Informations of Origin Account
+ Informations of Destination Account
+ Informations of Origin Account
+ Informations of Destination Account
+ Informations of Origin Account
+ Informations of Destination Account
+ Informations of Origin Account
+ Informations of Destination Account
+ Informations of Origin Account
+ Informations of Destination Account
+ Informations of Origin Account
+ Informations of Destination Account
+ Informations of Origin Account
+ Informations of Destination Account
+ Informations of Origin Account
+ Informations of Destination Account
+ Informations of Origin Account
+ Informations of Destination Account
+ Informations of Origin Account
+ Informations of Destination Account
+ Informations of Origin Account
+ Informations of Destination Account
+ Informations of Origin Account
+ Informations of Destination Account
+ Informations of Origin Account
+ Informations of Destination Account
+ 
+ 
+ 
+ Le ticket concerne un autre personnage
+ ticket-another-char
+ 
+ 
+ 
+ Informations of Origin Account
+ Informations of Destination Account
+ _Ticket_title
+ Informations of Origin Account
+ Informations of Destination Account
+ Informations of Origin Account
+ Informations of Destination Account
+ Informations of Origin Account
+ Informations of Destination Account
+ Informations of Origin Account
+ Informations of Destination Account
+ Informations of Origin Account
+ Informations of Destination Account
+ Informations of Origin Account
+ Informations of Destination Account
+ Informations of Origin Account
+ Informations of Destination Account
+ Informations of Origin Account
+ Informations of Destination Account
+ Informations of Origin Account
+ Informations of Destination Account
+ Informations of Origin Account
+ Informations of Destination Account
+ Char
+ Informations of Destination Account
+ slot_a
+ Informations of Destination Account
+ Informations of Destination Account
+ Informations of Destination Account
+ Informations of Destination Account
+ Informations of Destination Account
+ Informations of Destination Account
+ Informations of Destination Account
+ Informations of Destination Account
+ Informations of Destination Account
+ _Slot_a
+ Informations of Destination Account
+ Informations of Destination Account
+ Informations of Destination Account
+ Informations of Destination Account
+ channel_billing
+ ticket_billing_help
+ ticket_platform
+ channel_lost
+ Informations of Destination Account
+ ticket_lost_help
+ Informations of Destination Account
+ Informations of Destination Account
+ Informations of Destination Account
+ Informations of Destination Account
+ Emails
+ Informations of Destination Account
+ Informations of Destination Account
+ Informations of Destination Account
+ Informations of Destination Account
+ Informations of Destination Account
+ Informations of Destination Account
+ Informations of Destination Account
+ Informations of Destination Account
+ Informations of Destination Account
+ Informations of Destination Account
+ Informations of Destination Account
+ Informations of Destination Account
+ Informations of Destination Account
+ Informations of Destination Account
+ Informations of Destination Account
+ Informations of Destination Account
+ Informations of Destination Account
+ Informations of Destination Account
+ Informations of Destination Account
+ Informations of Destination Account
+ Informations of Destination Account
+ Informations of Destination Account
+ Informations of Destination Account
+ Informations of Destination Account
+ Informations of Destination Account
+ Informations of Destination Account
+ Informations of Destination Account
+ Informations of Destination Account
+ Informations of Destination Account
+ Informations of Destination Account
+ Informations of Destination Account
+ Informations of Destination Account
+ Informations of Destination Account
+ Informations of Destination Account
+ Informations of Destination Account
+ Informations of Destination Account
+ Informations of Destination Account
+ Informations of Destination Account
+ Informations of Destination Account
+ Informations of Destination Account
+ Informations of Destination Account
+ Informations of Destination Account
+ Informations of Destination Account
+ Informations of Destination Account
+ Informations of Destination Account
+ Informations of Destination Account
+ Informations of Destination Account
+ Informations of Destination Account
+ Informations of Destination Account
+ Informations of Destination Account
+ Informations of Destination Account
+ Informations of Destination Account
+ Informations of Destination Account
+ Informations of Destination Account
+ Informations of Destination Account
+ Informations of Destination Account
+ Informations of Destination Account
+ ticket_billing_subject
+ Informations of Destination Account
+ Informations of Destination Account
+ Informations of Account
+ Informations of Account
-  
+ technical_general
+ technical_crash
+ technical_missions
+ technical_patch
- _Ticket_title
+ Informations of Destination Account
- _Slot_a
+ Informations of Destination Account
+ Informations of Destination Account
+ Informations of Destination Account
- Informations of Destination Account
+ destination_account_informations
+ 
+ 
+ account_name
+ slot_number
+ 
+ slot_number_help
+ Login
+ Name
+ Birthday
+ Addresses
+ Informations of Account
+ name
+ birthday
+ addresses
+ emails
+ Informations of Account
+ Informations of Account
+ Informations of Account
+ Informations of Account
+ Informations of Account
+ Informations of Account
- Name
+ Informations of Account
+ Informations of Account
+ account_informations
-  
- Additionnal Informations
- Informations of Account
- Informations of Origin Account
- Le ticket concerne un autre personnage
- ticket_technical_infos1
- ticket_technical_infos2
- ticket_technical_infos3
- _help
- what_did_you_expect
- what_happens
- what_do_you_want_to_do
- Birthday
- Addresses
- Emails
+ for_char
+ 
+ 
+ select_char
+ 1
+ 2
+ 3
+ ticket_lost_subject
- ticket_lost_subject
-  
+ ticket_lost_subject
+ assign_myself
+ screens
+ add_screen
+ we_receive_your_ticket
+ we_receive_your_ticket
+ this_is_an_automatic_email
+ ticket_agent_new
+ ticket_agent_open
+ ticket_agent_wip
+ ticket_agent_closed
+ ticket_agent_done
+ ticket_agent_spam
+ 
+ 
+ ticket-char
- ticket-char
+ you_receive_message
+ you_receive_message
+ ticket_technical'_help
+ ticket_displayer'_help
+ ticket_technical'_help
+ ticket_displayer'_help
+ ticket_technical'_help
+ ticket_technical'_help
+ ticket_technical'_help
+ ticket_technical'_help
+ open_in_browser
+ open_in_browser_link
+ another_char
- another_char
+ Operating system
+ Title of the ticket
+ Title of the ticket
+ Title of the ticket
+ Title of the ticket
+ Title of the ticket
+ Title of the ticket
+ Title of the ticket
+ complete_all_fields
+ back_to_ticket_list
+ ticket_list
+ ticket
+ screens_available_outgame
+ you
+ ticket_restore_prefill
+ ticket_technical_prefill
+ ticket_rename_prefill
+ ticket_transfert_prefill
+ ticket_restore_notes
+ ticket_displayer_prefill
+ ticket_lost_prefill
+ ticket_billing_prefill
- ticket_technical'_help
+ ticket_general_prefill
+ 
+ 
+ 
+ 
+ 
-  
+ empty
+ please_answer
- ticket-new-section-bugs
- submit_note
- support
- ticket-new-section-missions
- ticket-new-section-patch
- ticket-new-section-crash
- ticket
- ticket_General_help
- ticket_done
- ticket_general_prefill
- ticket_lost_subject
- ticket_displayer'_help
- ticket_billing_prefill
- ticket_message
- ticket_list
- Title of the ticket
- validate-agent-change
- validate-channel-change
- you
+ add_screens
- screens
- screens_available_outgame
+ ticket_rename_infos
+ ticket_technical_infos
+ ticket_displayer_infos
+ ticket_general_infos
+ ticket_action
- ticket_action
- ticket_lost_help
+ ticket_lost_help
+ ticket_billing_infos
+ back_to_ticket_list
+ ticket_assignee
+ ticket_subject
+ ticket_creation_date
+ ticket_open
+ ticket
+ you
+ ticket_list
+ message_ticket_spam
+ message_choose_cat
+ click_to_read
+ ticket_waiting
+ ticket_lost_subject
= a:1:{i:0;s:120:"---> ¿Qué dice el [Código de Conducta] \n(https://app.ryzom.com/app_forum/index.php?page=topic/view/31710/1#1)? <----";}
= a:1:{i:0;s:117:"---> ¿Qué dice el [Código de Conducta](https://app.ryzom.com/app_forum/index.php?page=topic/view/31710/1#1)? <----";}
= a:1:{i:0;s:154:"¿Un problema con el ingreso al juego?\n¡La respuesta ya puede estar en nuestro [foro] (#https://app.ryzom.com/app_forum/index.php?page=forum/view/1841)!";}
= a:1:{i:0;s:153:"¿Un problema con el ingreso al juego?\n¡La respuesta ya puede estar en nuestro [foro](#https://app.ryzom.com/app_forum/index.php?page=forum/view/1841)!";}
= a:1:{i:0;s:1:"1";}
= a:1:{i:0;s:1:"2";}
= a:1:{i:0;s:1:"3";}
= a:1:{i:0;s:28:"Información sobre la cuenta";}
= a:1:{i:0;s:19:"Nombre de la cuenta";}
= a:1:{i:0;s:11:"Direcciones";}
= a:1:{i:0;s:46:"Añadir una captura de pantalla a la solicitud";}
= a:1:{i:0;s:152:"¿Adjuntar una captura de pantalla para ilustrar su problema?\n¡Envía tu solicitud desde [https://ts.ryzom.com](https://ts.ryzom.com) para adjuntarla!";}
= a:1:{i:0;s:23:"Asignarlo para mi mismo";}
= a:1:{i:0;s:9:"_Adjuntos";}
= a:1:{i:0;s:19:"_Regresar_al_inicio";}
= a:1:{i:0;s:34:"Regresar a la lista de solicitudes";}
= a:1:{i:0;s:19:"Fecha de nacimiento";}
= a:1:{i:0;s:9:"_Cancelar";}
= a:1:{i:0;s:31:"Problemas con las suscripciones";}
= a:1:{i:0;s:7:"Errores";}
= a:1:{i:0;s:26:"Desacuerdo entre jugadores";}
= a:1:{i:0;s:5:"Otros";}
= a:1:{i:0;s:20:"He perdido mi cuenta";}
= a:1:{i:0;s:22:"Renombrar un personaje";}
= a:1:{i:0;s:21:"Perdí mis personajes";}
= a:1:{i:0;s:19:"Problemas técnicos";}
= a:1:{i:0;s:24:"Transferir a otra cuenta";}
= a:1:{i:0;s:10:"_Personaje";}
= a:1:{i:0;s:69:"Hacer clic para leer la respuesta del Sistema de Solicitudes de Ryzom";}
= a:1:{i:0;s:26:"_Complete_todos_los_campos";}
= a:1:{i:0;s:39:"Información sobre la cuenta de destino";}
= a:1:{i:0;s:21:"Correos electrónicos";}
= a:1:{i:0;s:13:"_Información";}
= a:1:{i:0;s:15:"_Para_personaje";}
= a:1:{i:0;s:7:"_Acceso";}
= a:1:{i:0;s:74:"Por favor elija una categoría del menú izquierdo para crear su solicitud";}
= a:1:{i:0;s:142:"Crear múltiples solicitudes por la misma razón es penalizable con sanciones..<br> Responda a su solicitud para añadir información en ella.";}
= a:1:{i:0;s:19:"Dador de la misión";}
= a:1:{i:0;s:20:"Nombre de la misión";}
= a:1:{i:0;s:11:"Nombre real";}
= a:1:{i:0;s:15:"Nueva solicitud";}
= a:1:{i:0;s:85:"Para mayor comodidad en la edición o para facilitarla añada una captura de pantalla";}
= a:1:{i:0;s:40:"Abrir la página en un navegador externo";}
= a:1:{i:0;s:18:"_Sistema operativo";}
= a:1:{i:0;s:17:"Sistema operativo";}
= a:1:{i:0;s:19:"¿Qué desea hacer?";}
= a:1:{i:0;s:67:"Haga tres propuestas para un nuevo nombre, en orden de preferencia:";}
= a:1:{i:0;s:20:"Elija una categoría";}
= a:1:{i:0;s:23:"Seleccione un personaje";}
= a:1:{i:0;s:7:"_Enviar";}
= a:1:{i:0;s:42:"Por favor, elija el personaje a transferir";}
= a:1:{i:0;s:35:"Número de ranura (0, 1, 2, 3 ó 4)";}
= a:1:{i:0;s:30:"¡No debe poseer un personaje!";}
= a:1:{i:0;s:7:"_Enviar";}
= a:1:{i:0;s:15:"_Enviar_mensaje";}
= a:1:{i:0;s:17:"Falla del cliente";}
= a:1:{i:0;s:13:"Error general";}
= a:1:{i:0;s:18:"Error con misiones";}
= a:1:{i:0;s:27:"Error con el último parche";}
= a:1:{i:0;s:78:"Este es un correo automático, por favor no responda, solo use el enlace abajo";}
= a:1:{i:0;s:9:"Solicitud";}
= a:1:{i:0;s:68:"la solicitud está relacionada con otro personaje de mi pertenencia.";}
= a:1:{i:0;s:19:"Nombre de la cuenta";}
= a:1:{i:0;s:7:"Cerrado";}
= a:1:{i:0;s:45:"¡Esperando que el jugador vea la respuesta! ";}
= a:1:{i:0;s:18:"¡Nueva solicitud!";}
= a:1:{i:0;s:41:"El jugador vio la respuesta. Esperando...";}
= a:1:{i:0;s:18:"¡Nueva solicitud!";}
= a:1:{i:0;s:4:"Spam";}
= a:1:{i:0;s:34:"Jugador espera por la respuesta...";}
= a:1:{i:0;s:9:"Respuesta";}
= a:1:{i:0;s:8:"Asignado";}
= a:1:{i:0;s:50:"¡Añada aquí enlaces para plataforma de soporte!";}
= a:1:{i:0;s:75:"Por favor, describa su problema con la mayor precisión que le sea posible:";}
= a:1:{i:0;s:41:"Problema de suscripción vía "$platform"";}
= a:1:{i:0;s:10:"Categoría";}
= a:1:{i:0;s:51:"Nombre del personaje al cual concierne la solicitud";}
= a:1:{i:0;s:74:"Esta solicitud fue procesada, cerrada y mantenida por razones históricas.";}
= a:1:{i:0;s:70:"Por favor, describa su problema con tanto detalle como le sea posible:";}
= a:1:{i:0;s:18:"Fecha de creación";}
= a:1:{i:0;s:89:"Por favor, describa el contexto y el problema con la mayor precisión que le sea posible:";}
= a:1:{i:0;s:8:"$subject";}
= a:1:{i:0;s:42:"Por favor, ingrese su correo electrónico.";}
= a:1:{i:0;s:3:"---";}
= a:1:{i:0;s:89:"Por favor, describa el contexto y el problema con la mayor precisión que le sea posible:";}
= a:1:{i:0;s:8:"$subject";}
= a:1:{i:0;s:51:"Por favor, elija una de las categorías siguientes.";}
= a:1:{i:0;s:20:"Lista de solicitudes";}
= a:1:{i:0;s:59:"¿Olvidó el nombre de su cuenta y no puede acceder a ella?";}
= a:1:{i:0;s:196:"Nombre de la cuenta:\nPersonajes en la cuenta:\nNombre real de propietario de la cuenta: \nDirección postal:\nFecha de nacimiento:\nCorreo electrónico que pudo haberse usado:\nOtra información:";}
= a:1:{i:0;s:27:"Restauración de una cuenta";}
= a:1:{i:0;s:64:"Su solicitud ha sido enviada y un CSR se encargará de la misma.";}
= a:1:{i:0;s:5:"Abrir";}
= a:1:{i:0;s:10:"Plataforma";}
= a:1:{i:0;s:299:"* 1 renombre permitido por personaje para una  cuenta __gratuita___ .\n*1 renombre permitido cada 6 meses por personaje de una cuenta ___suscrita___ .\n¡Verificar la conformidad de sus propuestas con el [nombre del personaje](https://app.ryzom.com/app_forum/index.php?page=topic/view/31710/1#1)!  ";}
= a:1:{i:0;s:37:"Especificar la razón para renombrar:";}
= a:1:{i:0;s:45:"El jugador solicita un renombre para "$char".";}
= a:1:{i:0;s:71:"Por favor, llene su solicitud con tanta precisión como le sea posible.";}
= a:1:{i:0;s:386:"(*) Cuando los personajes pre-fusión son restaurados, ellos reemplazan a todos los personajes creados posteriormente si ellos ocupan la misma ubicación. Los personajes reemplazados de este modo no puede ser recuperados.\nCuando un personaje es recuperado, solo se recuperan sus habilidades y apariencia. Sus equipos, materiales, apartamento y mascotas se perdieron durante la fusión.";}
= a:1:{i:0;s:271:"• ¿Si usted desea restaurar un personaje borrado?\n---> Por favor, denos el nombre:\n\n• ¿Usted no ha jugado desde hace años y no ve su personaje en su cuenta?\n---> Por favor, confirme el nombre de la cuenta, nosotros la restauraremos con un inventario vacío(*):";}
= a:1:{i:0;s:56:"El jugador preguntó por la restauración de una cuenta.";}
= a:1:{i:0;s:52:"Por favor, seleccione una sección para la solicitud";}
= a:1:{i:0;s:18:"Esto es un spam :(";}
= a:1:{i:0;s:6:"Asunto";}
= a:1:{i:0;s:76:"Por favor, describa su problema técnico con tanto detalle como sea posible:";}
= a:1:{i:0;s:18:"$section: $subject";}
= a:1:{i:0;s:25:"Título para la solicitud";}
= a:1:{i:0;s:145:"¿Usted quiere transferir uno de sus personajes a otra de sus cuentas?\n___Es posible si las dos cuentas están suscritas por al menos un mes.___";}
= a:1:{i:0;s:43:"Transferir de "$char" a "$infosB1#$infosB2"";}
= a:1:{i:0;s:74:"Por favor, valide la solicitud usando el enlace en el correo electrónico.";}
= a:1:{i:0;s:69:"Un CSR le responderá tan pronto sea posible. Por favor sea paciente.";}
= a:1:{i:0;s:10:"Transferir";}
= a:1:{i:0;s:46:"Nosotros hemos recibido su solicitud #%s "%s".";}
= a:1:{i:0;s:5:"Usted";}
= a:1:{i:0;s:57:"Usted ha recibido una respuesta a su solicitud  #%s "%s".";}
- attachments
- cancel
- back_home
- Char
- complete_all_fields
- for_char
- Informations
- Login
- submit
- send
- Operating system
- submit_message
