+ send
+ submit
+ subscribed_
+ csr_options
- action
- agent
- csr_options
- date_end
- end
- subscribed_
- subscribed_6
- xsolla_change_plan-tooltip
- xsolla_change_plan_payment
- uiChange
- too_short_password
- box_login_title_line_2
- freetime_payment
- module
- module
- module
- params
- payment_m
- payment_m0
- put_back_original_password
- send
- set_temporary_password
- submit
- suspension-tooltip
- type
+ box_login_title_line_2
+ freetime_payment
+ suspension-tooltip
+ date_end
+ box_login_title_line_2
= a:1:{i:0;a:3:{i:0;s:22:"box_login_title_line_2";i:1;s:23:"_Box_login_title_line_2";i:2;s:1:" ";}}
+ set_temporary_password
+ subscribed_
+ put_back_original_password
+ admin
+ subscribed_6
= a:1:{i:0;a:3:{i:0;s:16:"freetime_payment";i:1;s:17:"_Freetime_payment";i:2;s:25:"Receive Free Premium Days";}}
= a:1:{i:0;a:3:{i:0;s:16:"freetime_payment";i:1;s:25:"Receive Free Premium Days";i:2;s:45:"Receive and activate my Free Premium days now";}}
= a:1:{i:0;a:3:{i:0;s:16:"freetime_payment";i:1;s:45:"Receive and activate my Free Premium days now";i:2;s:45:"Get and activate your free "Premium" days now";}}
= a:1:{i:0;a:3:{i:0;s:16:"freetime_payment";i:1;s:45:"Get and activate your free "Premium" days now";i:2;s:37:"Activate your free "Premium" days now";}}
+ freetime_voucher
+ account_creation_date
+ account_last_connexion
= a:1:{i:0;a:3:{i:0;s:21:"account_creation_date";i:1;s:22:"_Account_creation_date";i:2;s:22:"Account creation date:";}}
= a:0:{}
= a:1:{i:0;a:3:{i:0;s:22:"account_last_connexion";i:1;s:23:"_Account_last_connexion";i:2;s:15:"Last connexion:";}}
+ passwordss_dont_match
+ error_in_form
+ payment_d30
+ payment_d365
+ action
+ gift_to_player
+ gift_to_player
+ number_days_to_send_as_gift
+ 
+ PlayerName
+ Submit
+ Send
+ player_to_send_the_gift
+ validate
+ submit
+ gift_sent
+ back_home
+ player_not_found
+ no_enough_days
= a:1:{i:0;a:3:{i:0;s:1:"0";i:1;s:0:"";i:2;s:1:"_";}}
= a:0:{}
= a:1:{i:0;a:3:{i:0;s:6:"action";i:1;s:7:"_Action";i:2;s:7:"Actions";}}
= a:0:{}
= a:0:{}
= a:0:{}
= a:0:{}
= a:0:{}
= a:1:{i:0;a:3:{i:0;s:6:"action";i:1;s:7:"Actions";i:2;s:6:"Action";}}
= a:0:{}
= a:1:{i:0;a:3:{i:0;s:9:"back_home";i:1;s:10:"_Back_home";i:2;s:12:"Back to home";}}
= a:0:{}
= a:0:{}
= a:0:{}
= a:1:{i:0;a:3:{i:0;s:9:"back_home";i:1;s:12:"Back to home";i:2;s:36:"Back to home (or return to homepage)";}}
= a:1:{i:0;a:3:{i:0;s:14:"no_enough_days";i:1;s:15:"_No_enough_days";i:2;s:30:"No enough days for send a gift";}}
= a:0:{}
= a:0:{}
= a:0:{}
= a:1:{i:0;a:3:{i:0;s:14:"no_enough_days";i:1;s:30:"No enough days for send a gift";i:2;s:30:"Not enough days to send a gift";}}
= a:0:{}
= a:1:{i:0;a:3:{i:0;s:16:"player_not_found";i:1;s:17:"_Player_not_found";i:2;s:16:"Player not found";}}
= a:0:{}
= a:1:{i:0;a:3:{i:0;s:9:"gift_sent";i:1;s:10:"_Gift_sent";i:2;s:10:"Gift sent!";}}
= a:0:{}
= a:1:{i:0;a:3:{i:0;s:6:"submit";i:1;s:7:"_Submit";i:2;s:6:"Submit";}}
= a:0:{}
= a:1:{i:0;a:3:{i:0;s:8:"validate";i:1;s:9:"_Validate";i:2;s:8:"Validate";}}
= a:1:{i:0;a:3:{i:0;s:23:"player_to_send_the_gift";i:1;s:24:"_Player_to_send_the_gift";i:2;s:54:"Enter the name of the player who will receive the gift";}}
= a:0:{}
- Send
- Submit
= a:1:{i:0;a:3:{i:0;s:10:"PlayerName";i:1;s:11:"_PlayerName";i:2;s:19:"Name of the player:";}}
= a:0:{}
= a:1:{i:0;a:3:{i:0;s:27:"number_days_to_send_as_gift";i:1;s:28:"_Number_days_to_send_as_gift";i:2;s:31:"Number of days to send as gift:";}}
= a:0:{}
= a:1:{i:0;a:3:{i:0;s:14:"gift_to_player";i:1;s:15:"_Gift_to_player";i:2;s:44:"Send subscription days as a gift to a player";}}
= a:0:{}
= a:0:{}
= a:0:{}
= a:0:{}
= a:1:{i:0;a:3:{i:0;s:14:"gift_to_player";i:1;s:44:"Send subscription days as a gift to a player";i:2;s:12:"Send as gift";}}
- subscribed_
- subscribed_6
- payment_d30
- payment_d365
- box_login_title_line_2
-  
- 0
= a:1:{i:0;a:3:{i:0;s:23:"player_to_send_the_gift";i:1;s:54:"Enter the name of the player who will receive the gift";i:2;s:33:"Player who will received the gift";}}
= a:0:{}
= a:1:{i:0;a:3:{i:0;s:27:"number_days_to_send_as_gift";i:1;s:31:"Number of days to send as gift:";i:2;s:30:"Number of days to send as gift";}}
= a:0:{}
= a:0:{}
= a:0:{}
= a:0:{}
= a:1:{i:0;a:3:{i:0;s:27:"number_days_to_send_as_gift";i:1;s:30:"Number of days to send as gift";i:2;s:31:"Number of days to send as gift:";}}
= a:0:{}
= a:1:{i:0;a:3:{i:0;s:23:"player_to_send_the_gift";i:1;s:33:"Player who will received the gift";i:2;s:34:"Player who will received the gift:";}}
+ subscribed_
+ payment_d30
+ payment_d365
+ payment_m1200
+ subscribed_6
+ ticket_char_name
+ from_char
+ message
+ email_title_gift_sent
+ email_message_gift_sent
+ a_friend
+ bad_token
+ no_transaction
- a_friend
- subscribed_6
+ message_ticket_spam
= a:1:{i:0;a:3:{i:0;s:19:"message_ticket_spam";i:1;s:20:"_Message_ticket_spam";i:2;s:114:"Creating multiple tickets for the same reason is punishable by sanctions. Reply to the ticket to add informations.";}}
= a:0:{}
= a:0:{}
= a:0:{}
- message_ticket_spam
+ EmailLang
= a:1:{i:0;a:3:{i:0;s:9:"EmailLang";i:1;s:10:"_EmailLang";i:2;s:19:"Language for Emails";}}
+ de
+ es
+ ru
+ en
+ fr
= a:1:{i:0;a:3:{i:0;s:2:"fr";i:1;s:3:"_Fr";i:2;s:6:"French";}}
+ player_not_found
= a:1:{i:0;a:3:{i:0;s:16:"player_not_found";i:1;s:17:"_Player_not_found";i:2;s:22:"Spieler nicht gefunden";}}
= a:1:{i:0;a:3:{i:0;s:16:"player_not_found";i:1;s:22:"Spieler nicht gefunden";i:2;s:16:"Player not found";}}
= a:0:{}
