<?xml version="1.0" encoding="UTF-8" standalone="no"?>
<svg
   xmlns:dc="http://purl.org/dc/elements/1.1/"
   xmlns:cc="http://creativecommons.org/ns#"
   xmlns:rdf="http://www.w3.org/1999/02/22-rdf-syntax-ns#"
   xmlns:svg="http://www.w3.org/2000/svg"
   xmlns="http://www.w3.org/2000/svg"
   xmlns:sodipodi="http://sodipodi.sourceforge.net/DTD/sodipodi-0.dtd"
   xmlns:inkscape="http://www.inkscape.org/namespaces/inkscape"
   sodipodi:docname="steam.svg"
   inkscape:version="1.0 (4035a4fb49, 2020-05-01)"
   id="svg46"
   version="1.1"
   viewBox="0 0 28.000002 6.7482662"
   height="6.7482662mm"
   width="28.000002mm">
  <defs
     id="defs40" />
  <sodipodi:namedview
     fit-margin-bottom="0"
     fit-margin-right="0"
     fit-margin-left="0"
     fit-margin-top="0"
     inkscape:window-maximized="1"
     inkscape:window-y="87"
     inkscape:window-x="2107"
     inkscape:window-height="1032"
     inkscape:window-width="1715"
     showgrid="false"
     inkscape:document-rotation="0"
     inkscape:current-layer="layer1"
     inkscape:document-units="mm"
     inkscape:cy="350.98475"
     inkscape:cx="-5.0775241"
     inkscape:zoom="0.49497475"
     inkscape:pageshadow="2"
     inkscape:pageopacity="0.0"
     borderopacity="1.0"
     bordercolor="#666666"
     pagecolor="#ffffff"
     id="base" />
  <metadata
     id="metadata43">
    <rdf:RDF>
      <cc:Work
         rdf:about="">
        <dc:format>image/svg+xml</dc:format>
        <dc:type
           rdf:resource="http://purl.org/dc/dcmitype/StillImage" />
        <dc:title></dc:title>
      </cc:Work>
    </rdf:RDF>
  </metadata>
  <g
     transform="translate(-86.146279,-77.297635)"
     id="layer1"
     inkscape:groupmode="layer"
     inkscape:label="Calque 1">
    <path
       style="stroke-width:0.0661595"
       d="m 114.14628,78.713447 h -0.13232 V 78.38265 l -0.13232,0.218326 h -0.0662 l -0.0662,-0.218326 v 0.330797 h -0.13232 v -0.562355 h 0.13232 l 0.13232,0.304333 0.13232,-0.304333 h 0.13232 z m -0.59543,-0.463116 h -0.13232 v 0.463116 h -0.13232 v -0.463116 h -0.13232 v -0.09924 h 0.39696 z m -0.72776,2.084023 h -0.39696 v -1.270262 l -0.46311,0.826993 h -0.26464 l -0.39696,-0.826993 v 1.270262 h -0.46311 v -2.183262 h 0.46311 l 0.52928,1.177638 0.59543,-1.177638 h 0.39696 z m -2.58022,0 h -0.46311 l -0.13232,-0.383725 h -0.72776 l -0.13231,0.383725 h -0.46312 l 0.79391,-2.183262 h 0.3308 z m -0.66159,-0.747602 -0.26464,-0.793914 -0.26464,0.793914 z m -1.91863,0.747602 h -1.4555 v -2.183262 h 1.4555 v 0.377109 h -0.99239 v 0.516044 h 0.86008 v 0.377108 h -0.86008 v 0.535892 h 0.99239 z m -2.1171,-1.806153 h -0.52927 v 1.806153 h -0.46312 v -1.806153 h -0.59543 v -0.377109 h 1.58782 z m -2.1171,1.164406 c 0,0.449884 -0.39696,0.654978 -0.79391,0.661594 -0.39696,0 -0.6616,-0.09262 -0.79392,-0.291101 l 0.26464,-0.271254 c 0.13232,0.119087 0.26464,0.185247 0.52928,0.185247 0.26463,0 0.39695,-0.09262 0.39695,-0.271254 0,-0.165399 -0.13232,-0.238174 -0.26463,-0.264638 l -0.26464,-0.03308 c -0.39696,-0.05293 -0.59544,-0.258021 -0.59544,-0.615283 0,-0.198478 0.0662,-0.357261 0.19848,-0.482963 0.13232,-0.119087 0.3308,-0.178631 0.52928,-0.178631 0.33079,0 0.52927,0.08601 0.72775,0.251406 l -0.26464,0.271254 c -0.13232,-0.09924 -0.26464,-0.152167 -0.46311,-0.152167 -0.19848,0.01323 -0.3308,0.08601 -0.3308,0.27787 0,0.152166 0.13232,0.224941 0.26464,0.238174 l 0.26463,0.0397 c 0.3308,0.0397 0.59544,0.264638 0.59544,0.635131 z m -3.37413,-0.396957 c 0,0.595435 -0.529281,1.078399 -1.124711,1.078399 -0.59544,0 -1.05855,-0.482964 -1.05855,-1.078399 0,-0.588819 0.46311,-1.071783 1.05855,-1.071783 0.59543,0 1.124711,0.482964 1.124711,1.071783 z m -1.124711,-1.998015 c -1.05855,0 -1.98479,0.886537 -1.98479,1.991399 l -1.25703,1.792922 c -0.0661,-0.0067 -0.0661,-0.01323 -0.13231,-0.01323 -0.26464,0 -0.52928,0.07939 -0.79392,0.211711 l -5.65001,-2.275886 c -0.15217,-0.674826 -0.75422,-1.177637 -1.46874,-1.177637 -0.82038,0 -1.49653,0.674826 -1.49653,1.501819 0,0.820377 0.67615,1.495203 1.49653,1.495203 0.28455,0 0.5425,-0.07278 0.76751,-0.21171 l 5.68971,2.275885 c 0.13232,0.694674 0.72776,1.15779 1.45551,1.15779 0.72776,0 1.38935,-0.595434 1.45551,-1.329804 l 1.91862,-1.402581 c 1.124711,0 2.050951,-0.899768 2.050951,-2.011247 -9e-5,-1.104863 -0.9263,-2.004631 -2.051011,-2.004631 z m 0,0.661594 c 0.79391,0 1.389351,0.602051 1.389351,1.343037 0,0.747602 -0.595441,1.349653 -1.389351,1.349653 -0.72776,0 -1.32319,-0.602051 -1.32319,-1.349653 0,-0.740986 0.59543,-1.343037 1.32319,-1.343037 z m -11.2868,0.264638 c 0.42342,0 0.79391,0.231558 0.97922,0.582203 l -0.54919,-0.218326 c -0.44327,-0.158782 -0.93285,0.05954 -1.11148,0.496196 -0.17201,0.443268 0.0265,0.939464 0.4565,1.131326 l 0.46312,0.185247 c -0.0728,0.01985 -0.15217,0.02646 -0.23824,0.02646 -0.6086,0 -1.09825,-0.48958 -1.09825,-1.098247 9e-5,-0.615283 0.48965,-1.104863 1.09832,-1.104863 z m 7.91267,3.241813 c 0.59543,0 1.05855,0.496196 1.05855,1.104863 0,0.615283 -0.46312,1.078399 -1.05855,1.078399 -0.46312,0 -0.79392,-0.198478 -0.9924,-0.562356 0.19848,0.09924 0.3308,0.165399 0.52928,0.231559 0.46312,0.198478 0.92623,-0.06616 1.12471,-0.48958 0.13232,-0.410123 0,-0.972478 -0.46312,-1.151108 l -0.46311,-0.185247 c 0.0662,-0.0133 0.19848,-0.02653 0.26464,-0.02653 z"
       id="path48" />
  </g>
</svg>
